Running '. ./init-build-env; bitbake core-image-minimal:do_testimage core-image-sato:do_testimage core-image-sato-sdk:do_testimage core-image-sato:do_testsdk core-image-minimal:do_testsdkext core-image-sato:do_testsdkext -k' with output to /srv/pokybuild/yocto-worker/qemuriscv64/build/build/command-1-test-targets.log in /srv/pokybuild/yocto-worker/qemuriscv64/build/build
Poky - The Yocto Project testing distribution
NOTE: Reconnecting to bitbake server...
Loading cache...done.
Loaded 1989 entries from dependency cache.
NOTE: Resolving any missing task queue dependencies

Build Configuration:
BB_VERSION           = "2.20.0"
BUILD_SYS            = "x86_64-linux"
NATIVELSBSTRING      = "ubuntu-26.04"
TARGET_SYS           = "riscv64-poky-linux"
MACHINE              = "qemuriscv64"
SDKMACHINE           = "x86_64"
DISTRO               = "poky"
DISTRO_VERSION       = "6.1.99+snapshot-b62d5e681741394ad90501a83a1c66b0e3ab7ce3"
TUNE_FEATURES        = "rv 64 i m a f d c zicsr zifencei"
meta                 = "master:b62d5e681741394ad90501a83a1c66b0e3ab7ce3"
meta-yocto-bsp       
meta-poky            = "master:61c27a174a1feb2a9f211c0475ed6c8e413392b0"

Initialising tasks...Sstate summary: Wanted 148 Local 148 Mirrors 0 Missed 0 Current 303 (100% match, 100% complete)
done.
NOTE: Executing Tasks
NOTE: Setscene tasks completed
NOTE: Running task 1547 of 1552 (/srv/pokybuild/yocto-worker/qemuriscv64/build/layers/openembedded-core/meta/recipes-sato/images/core-image-sato-sdk.bb:do_testimage)
NOTE: Running task 1548 of 1552 (/srv/pokybuild/yocto-worker/qemuriscv64/build/layers/openembedded-core/meta/recipes-sato/images/core-image-sato.bb:do_testimage)
NOTE: Running task 1549 of 1552 (/srv/pokybuild/yocto-worker/qemuriscv64/build/layers/openembedded-core/meta/recipes-sato/images/core-image-sato.bb:do_testsdkext)
NOTE: Running task 1550 of 1552 (/srv/pokybuild/yocto-worker/qemuriscv64/build/layers/openembedded-core/meta/recipes-sato/images/core-image-sato.bb:do_testsdk)
NOTE: Running task 1551 of 1552 (/srv/pokybuild/yocto-worker/qemuriscv64/build/layers/openembedded-core/meta/recipes-core/images/core-image-minimal.bb:do_testimage)
NOTE: Running task 1552 of 1552 (/srv/pokybuild/yocto-worker/qemuriscv64/build/layers/openembedded-core/meta/recipes-core/images/core-image-minimal.bb:do_testsdkext)
NOTE: recipe core-image-sato-1.0-r0: task do_testimage: Started
NOTE: recipe core-image-sato-1.0-r0: task do_testsdkext: Started
NOTE: recipe core-image-sato-sdk-1.0-r0: task do_testimage: Started
NOTE: recipe core-image-minimal-1.0-r0: task do_testsdkext: Started
NOTE: recipe core-image-sato-1.0-r0: task do_testsdk: Started
NOTE: recipe core-image-minimal-1.0-r0: task do_testimage: Started
QMP Available for connection at /srv/pokybuild/yocto-worker/qemuriscv64/build/build/tmp/.m9698dcf
QMP Available for connection at /srv/pokybuild/yocto-worker/qemuriscv64/build/build/tmp/.fjodlsfw
QMP Available for connection at /srv/pokybuild/yocto-worker/qemuriscv64/build/build/tmp/.1m0sx2u8
QMP connected to QEMU at 10/30/26 08:18:51 and took 4.04 seconds
QMP released QEMU at 10/30/26 08:18:51 and took 0.48 seconds from connect
QMP connected to QEMU at 10/30/26 08:18:54 and took 7.92 seconds
QMP released QEMU at 10/30/26 08:18:54 and took 0.21 seconds from connect
QMP connected to QEMU at 10/30/26 08:19:17 and took 30.41 seconds
QMP released QEMU at 10/30/26 08:19:17 and took 0.19 seconds from connect
Test requires apt to be installed
Test requires dropbear, or openssh-sshd to be installed
Test requires autoconf to be installed
Test requires gtk+3 to be installed
Test requires autoconf to be installed
Test requires connman to be installed
Test case connman.ConnmanTest.test_connmand_running depends on connman.ConnmanTest.test_connmand_help but it didn't pass/run.
Test case date.DateTest.test_date depends on ssh.SSHTest.test_ssh but it didn't pass/run.
Test case df.DfTest.test_df depends on ssh.SSHTest.test_ssh but it didn't pass/run.
Test case dnf.DnfBasicTest.test_dnf_help depends on ssh.SSHTest.test_ssh but it didn't pass/run.
Test case dnf.DnfBasicTest.test_dnf_history depends on dnf.DnfBasicTest.test_dnf_help but it didn't pass/run.
Test case dnf.DnfBasicTest.test_dnf_info depends on dnf.DnfBasicTest.test_dnf_help but it didn't pass/run.
Test case dnf.DnfBasicTest.test_dnf_search depends on dnf.DnfBasicTest.test_dnf_help but it didn't pass/run.
Test case dnf.DnfBasicTest.test_dnf_version depends on dnf.DnfBasicTest.test_dnf_help but it didn't pass/run.
Test case dnf.DnfRepoTest.test_dnf_makecache depends on dnf.DnfBasicTest.test_dnf_help but it didn't pass/run.
Test case dnf.DnfRepoTest.test_dnf_exclude depends on dnf.DnfRepoTest.test_dnf_makecache but it didn't pass/run.
Test case dnf.DnfRepoTest.test_dnf_install depends on dnf.DnfRepoTest.test_dnf_makecache but it didn't pass/run.
Test case dnf.DnfRepoTest.test_dnf_install_dependency depends on dnf.DnfRepoTest.test_dnf_install but it didn't pass/run.
Test case dnf.DnfRepoTest.test_dnf_install_from_disk depends on dnf.DnfRepoTest.test_dnf_install_dependency but it didn't pass/run.
Test case dnf.DnfRepoTest.test_dnf_install_from_http depends on dnf.DnfRepoTest.test_dnf_install_from_disk but it didn't pass/run.
Test case dnf.DnfRepoTest.test_dnf_installroot depends on dnf.DnfRepoTest.test_dnf_makecache but it didn't pass/run.
Test run when enable usrmerge
Test case dnf.DnfRepoTest.test_dnf_reinstall depends on dnf.DnfRepoTest.test_dnf_install but it didn't pass/run.
Test case dnf.DnfRepoTest.test_dnf_repoinfo depends on dnf.DnfRepoTest.test_dnf_makecache but it didn't pass/run.
Test requires gcc to be installed
Test requires g++ to be installed
Test requires g++ to be installed
Test requires make to be installed
Test requires python3-pygobject to be installed
Test requires cgo-helloworld to be installed
Test requires go-runtime-dev to be installed
Test requires go-runtime-dev to be installed
Test requires go-helloworld to be installed
Test requires gcc to be installed
Test case ldd.LddTest.test_ldd depends on ssh.SSHTest.test_ssh but it didn't pass/run.
Test requires logrotate to be installed
Test case logrotate.LogrotateTest.test_logrotate_newlog depends on logrotate.LogrotateTest.test_logrotate_wtmp but it didn't pass/run.
Test case oe_syslog.SyslogTest.test_syslog_running depends on ssh.SSHTest.test_ssh but it didn't pass/run.
Test case oe_syslog.SyslogTestConfig.test_syslog_logger depends on oe_syslog.SyslogTest.test_syslog_running but it didn't pass/run.
Test case oe_syslog.SyslogTestConfig.test_syslog_restart depends on oe_syslog.SyslogTest.test_syslog_running but it didn't pass/run.
Test case oe_syslog.SyslogTestConfig.test_syslog_startup_config depends on oe_syslog.SyslogTestConfig.test_syslog_logger but it didn't pass/run.
Test requires opkg to be installed
Test requires shadow-base to be installed
Test case parselogs.ParseLogsTest.test_parselogs depends on ssh.SSHTest.test_ssh but it didn't pass/run.
Test requires perl to be installed
Test requires ptest-runner to be installed
Test requires ptest-runner to be installed
Test requires python3-core to be installed
Test case rpm.RpmBasicTest.test_rpm_help depends on ssh.SSHTest.test_ssh but it didn't pass/run.
Test case rpm.RpmBasicTest.test_rpm_query depends on rpm.RpmBasicTest.test_rpm_help but it didn't pass/run.
Test case rpm.RpmBasicTest.test_rpm_query_nonroot depends on rpm.RpmBasicTest.test_rpm_query but it didn't pass/run.
Test case rpm.RpmInstallRemoveTest.test_rpm_install depends on rpm.RpmBasicTest.test_rpm_query but it didn't pass/run.
Test case rpm.RpmInstallRemoveTest.test_rpm_remove depends on rpm.RpmInstallRemoveTest.test_rpm_install but it didn't pass/run.
Test case rpm.RpmInstallRemoveTest.test_check_rpm_install_removal_log_file_size depends on rpm.RpmInstallRemoveTest.test_rpm_remove but it didn't pass/run.
Test requires rust-c-lib-example-bin to be installed
Test requires openssh-scp to be installed
Test requires openssh-scp to be installed
Test requires openssh-sftp-server, or openssh-scp to be installed
Test requires kernel-devsrc to be installed
Test case systemd.SystemdBasicTests.test_systemd_basic depends on ssh.SSHTest.test_ssh but it didn't pass/run.
Test case systemd.SystemdBasicTests.test_systemd_failed depends on systemd.SystemdBasicTests.test_systemd_basic but it didn't pass/run.
Test case systemd.SystemdBasicTests.test_systemd_list depends on systemd.SystemdBasicTests.test_systemd_basic but it didn't pass/run.
Test case systemd.SystemdJournalTests.test_systemd_boot_time depends on systemd.SystemdBasicTests.test_systemd_basic but it didn't pass/run.
Test case systemd.SystemdJournalTests.test_systemd_journal depends on systemd.SystemdBasicTests.test_systemd_basic but it didn't pass/run.
Test requires minidebuginfo to be in DISTRO_FEATURES
Test case systemd.SystemdServiceTests.test_systemd_status depends on systemd.SystemdBasicTests.test_systemd_basic but it didn't pass/run.
Test case systemd.SystemdServiceTests.test_systemd_disable_enable depends on systemd.SystemdServiceTests.test_systemd_status but it didn't pass/run.
Test is only meant to run with read-only-rootfs in IMAGE_FEATURES
Test case systemd.SystemdServiceTests.test_systemd_stop_start depends on systemd.SystemdServiceTests.test_systemd_status but it didn't pass/run.
Test requires wayland-utils to be installed
Test requires weston to be installed
Test requires weston to be installed
Test requires weston to be installed
Test requires xserver-nodm-init to be installed
Output from runqemu:
runqemu - INFO - Received signal: 15
runqemu - INFO - Cleaning up
runqemu - INFO - Host uptime: 909941.73

runqemu - INFO - Removing /srv/pokybuild/yocto-worker/qemuriscv64/build/build/tmp/deploy/images/qemuriscv64/core-image-minimal-qemuriscv64.rootfs-20261030010749.ext4
runqemu - INFO - Removing /home/pokybuild/tmp/core-image-minimal-qemuriscv64.rootfs-20261030010749.ext4.2096441
tput: No value for $TERM and no -T specified

Test requires apt to be installed
Test requires autoconf to be installed
Test requires gtk+3 to be installed
Test requires autoconf to be installed
RESULTS:
RESULTS - parselogs.ParseLogsTest.test_get_context: PASSED (0.00s)
RESULTS - ping.PingTest.test_ping: PASSED (0.16s)
RESULTS - apt.AptRepoTest.test_apt_install_from_repo: SKIPPED (0.00s)
RESULTS - buildcpio.BuildCpioTest.test_cpio: SKIPPED (0.00s)
RESULTS - buildgalculator.GalculatorTest.test_galculator: SKIPPED (0.00s)
RESULTS - buildlzip.BuildLzipTest.test_lzip: SKIPPED (0.00s)
RESULTS - connman.ConnmanTest.test_connmand_help: SKIPPED (0.00s)
RESULTS - connman.ConnmanTest.test_connmand_running: SKIPPED (0.00s)
RESULTS - date.DateTest.test_date: SKIPPED (0.00s)
RESULTS - df.DfTest.test_df: SKIPPED (0.00s)
RESULTS - dnf.DnfBasicTest.test_dnf_help: SKIPPED (0.00s)
RESULTS - dnf.DnfBasicTest.test_dnf_history: SKIPPED (0.00s)
RESULTS - dnf.DnfBasicTest.test_dnf_info: SKIPPED (0.00s)
RESULTS - dnf.DnfBasicTest.test_dnf_search: SKIPPED (0.00s)
RESULTS - dnf.DnfBasicTest.test_dnf_version: SKIPPED (0.00s)
RESULTS - dnf.DnfRepoTest.test_dnf_exclude: SKIPPED (0.00s)
RESULTS - dnf.DnfRepoTest.test_dnf_install: SKIPPED (0.00s)
RESULTS - dnf.DnfRepoTest.test_dnf_install_dependency: SKIPPED (0.00s)
RESULTS - dnf.DnfRepoTest.test_dnf_install_from_disk: SKIPPED (0.00s)
RESULTS - dnf.DnfRepoTest.test_dnf_install_from_http: SKIPPED (0.00s)
RESULTS - dnf.DnfRepoTest.test_dnf_installroot: SKIPPED (0.00s)
RESULTS - dnf.DnfRepoTest.test_dnf_installroot_usrmerge: SKIPPED (0.00s)
RESULTS - dnf.DnfRepoTest.test_dnf_makecache: SKIPPED (0.00s)
RESULTS - dnf.DnfRepoTest.test_dnf_reinstall: SKIPPED (0.00s)
RESULTS - dnf.DnfRepoTest.test_dnf_repoinfo: SKIPPED (0.00s)
RESULTS - gcc.GccCompileTest.test_gcc_compile: SKIPPED (0.00s)
RESULTS - gcc.GccCompileTest.test_gpp2_compile: SKIPPED (0.00s)
RESULTS - gcc.GccCompileTest.test_gpp_compile: SKIPPED (0.00s)
RESULTS - gcc.GccCompileTest.test_make: SKIPPED (0.00s)
RESULTS - gi.GObjectIntrospectionTest.test_python: SKIPPED (0.00s)
RESULTS - go.CgoHelloworldTest.test_cgohelloworld: SKIPPED (0.00s)
RESULTS - go.GoCompileTest.test_go_compile: SKIPPED (0.00s)
RESULTS - go.GoCompileTest.test_go_module: SKIPPED (0.00s)
RESULTS - go.GoHelloworldTest.test_gohelloworld: SKIPPED (0.00s)
RESULTS - kernelmodule.KernelModuleTest.test_kernel_module: SKIPPED (0.00s)
RESULTS - ldd.LddTest.test_ldd: SKIPPED (0.00s)
RESULTS - logrotate.LogrotateTest.test_logrotate_newlog: SKIPPED (0.00s)
RESULTS - logrotate.LogrotateTest.test_logrotate_wtmp: SKIPPED (0.00s)
RESULTS - oe_syslog.SyslogTest.test_syslog_running: SKIPPED (0.00s)
RESULTS - oe_syslog.SyslogTestConfig.test_syslog_logger: SKIPPED (0.00s)
RESULTS - oe_syslog.SyslogTestConfig.test_syslog_restart: SKIPPED (0.00s)
RESULTS - oe_syslog.SyslogTestConfig.test_syslog_startup_config: SKIPPED (0.00s)
RESULTS - opkg.OpkgRepoTest.test_opkg_install_from_repo: SKIPPED (0.00s)
RESULTS - pam.PamBasicTest.test_pam: SKIPPED (0.00s)
RESULTS - parselogs.ParseLogsTest.test_parselogs: SKIPPED (0.00s)
RESULTS - perl.PerlTest.test_perl_works: SKIPPED (0.00s)
RESULTS - ptest.PtestRunnerTest.test_ptestrunner_expectfail: SKIPPED (0.00s)
RESULTS - ptest.PtestRunnerTest.test_ptestrunner_expectsuccess: SKIPPED (0.00s)
RESULTS - python.PythonTest.test_python3: SKIPPED (0.00s)
RESULTS - rpm.RpmBasicTest.test_rpm_help: SKIPPED (0.00s)
RESULTS - rpm.RpmBasicTest.test_rpm_query: SKIPPED (0.00s)
RESULTS - rpm.RpmBasicTest.test_rpm_query_nonroot: SKIPPED (0.00s)
RESULTS - rpm.RpmInstallRemoveTest.test_check_rpm_install_removal_log_file_size: SKIPPED (0.00s)
RESULTS - rpm.RpmInstallRemoveTest.test_rpm_install: SKIPPED (0.00s)
RESULTS - rpm.RpmInstallRemoveTest.test_rpm_remove: SKIPPED (0.00s)
RESULTS - rust.RustCLibExampleTest.test_rust_c_lib_example: SKIPPED (0.00s)
RESULTS - rust.RustCompileTest.test_cargo_compile: SKIPPED (0.00s)
RESULTS - rust.RustCompileTest.test_rust_compile: SKIPPED (0.00s)
RESULTS - scp.ScpTest.test_scp_file: SKIPPED (0.00s)
RESULTS - ssh.SSHTest.test_ssh: SKIPPED (0.00s)
RESULTS - stap.StapTest.test_stap: SKIPPED (0.00s)
RESULTS - systemd.SystemdBasicTests.test_systemd_basic: SKIPPED (0.00s)
RESULTS - systemd.SystemdBasicTests.test_systemd_failed: SKIPPED (0.00s)
RESULTS - systemd.SystemdBasicTests.test_systemd_list: SKIPPED (0.00s)
RESULTS - systemd.SystemdJournalTests.test_systemd_boot_time: SKIPPED (0.00s)
RESULTS - systemd.SystemdJournalTests.test_systemd_journal: SKIPPED (0.00s)
RESULTS - systemd.SystemdServiceTests.test_systemd_coredump_minidebuginfo: SKIPPED (0.00s)
RESULTS - systemd.SystemdServiceTests.test_systemd_disable_enable: SKIPPED (0.00s)
RESULTS - systemd.SystemdServiceTests.test_systemd_disable_enable_ro: SKIPPED (0.00s)
RESULTS - systemd.SystemdServiceTests.test_systemd_status: SKIPPED (0.00s)
RESULTS - systemd.SystemdServiceTests.test_systemd_stop_start: SKIPPED (0.00s)
RESULTS - weston.WestonTest.test_wayland_info: SKIPPED (0.00s)
RESULTS - weston.WestonTest.test_weston_can_initialize_new_wayland_compositor: SKIPPED (0.00s)
RESULTS - weston.WestonTest.test_weston_running: SKIPPED (0.00s)
RESULTS - weston.WestonTest.test_weston_supports_xwayland: SKIPPED (0.00s)
RESULTS - xorg.XorgTest.test_xorg_running: SKIPPED (0.00s)
SUMMARY:
core-image-minimal () - Ran 76 tests in 0.607s
core-image-minimal - OK - All required tests passed (successes=2, skipped=74, failures=0, errors=0)
NOTE: recipe core-image-minimal-1.0-r0: task do_testimage: Succeeded
Test requires apt to be installed
SDK testing environment: riscv64imafdc_zicsr_zifencei-poky-linux
Extensible SDK testing environment: riscv64imafdc_zicsr_zifencei-poky-linux
Extensible SDK testing environment: riscv64imafdc_zicsr_zifencei-poky-linux
GoCompileTest class: go command not available: Command '. /srv/pokybuild/yocto-worker/qemuriscv64/build/build/tmp/work/qemuriscv64-poky-linux/core-image-sato/1.0/testimage-sdk/environment-setup-riscv64imafdc_zicsr_zifencei-poky-linux > /dev/null; which go;' returned non-zero exit status 1.
Standard Output: 
GoCompileTest class: go command not available: Command '. /srv/pokybuild/yocto-worker/qemuriscv64/build/build/tmp/work/qemuriscv64-poky-linux/core-image-sato/1.0/testimage-sdk/environment-setup-riscv64imafdc_zicsr_zifencei-poky-linux > /dev/null; which go;' returned non-zero exit status 1.
Standard Output: 
GoHostCompileTest class: go command not available: Command '. /srv/pokybuild/yocto-worker/qemuriscv64/build/build/tmp/work/qemuriscv64-poky-linux/core-image-sato/1.0/testimage-sdk/environment-setup-riscv64imafdc_zicsr_zifencei-poky-linux > /dev/null; which go;' returned non-zero exit status 1.
Standard Output: 
GoHostCompileTest class: go command not available: Command '. /srv/pokybuild/yocto-worker/qemuriscv64/build/build/tmp/work/qemuriscv64-poky-linux/core-image-sato/1.0/testimage-sdk/environment-setup-riscv64imafdc_zicsr_zifencei-poky-linux > /dev/null; which go;' returned non-zero exit status 1.
Standard Output: 
Test kmod.KernelModuleTest.test_cryptodev needs one of kernel-devsrc
Test maturin.MaturinDevelopTest.test_maturin_develop needs one of python3-maturin
Test maturin.MaturinTest.test_maturin_list_python needs one of python3-maturin
RESULTS:
RESULTS - autotools.AutotoolsTest.test_cpio: PASSED (245.81s)
RESULTS - cmake.CMakeTest.test_assimp: PASSED (877.29s)
RESULTS - gcc.GccCompileTest.test_gcc_compile: PASSED (0.73s)
RESULTS - gcc.GccCompileTest.test_gpp2_compile: PASSED (0.92s)
RESULTS - gcc.GccCompileTest.test_gpp_compile: PASSED (2.37s)
RESULTS - gcc.GccCompileTest.test_make: PASSED (1.07s)
RESULTS - gtk3.GTK3Test.test_libhandy: PASSED (80.80s)
RESULTS - makefile.MakefileTest.test_lzip: PASSED (33.51s)
RESULTS - manifest.ManifestTest.test_manifests: PASSED (0.00s)
RESULTS - meson.MesonTest.test_iputils: PASSED (58.84s)
RESULTS - perl.PerlTest.test_perl: PASSED (0.15s)
RESULTS - python.Python3Test.test_python3: PASSED (0.30s)
RESULTS - rust.RustCompileTest.test_cargo_build: PASSED (154.80s)
RESULTS - rust.RustHostCompileTest.test_cargo_build: PASSED (119.20s)
RESULTS - go.GoCompileTest.test_go_build: SKIPPED (0.09s)
RESULTS - go.GoCompileTest.test_go_module: SKIPPED (0.06s)
RESULTS - go.GoHostCompileTest.test_go_cross_compile: SKIPPED (0.07s)
RESULTS - go.GoHostCompileTest.test_go_module_cross_compile: SKIPPED (0.09s)
RESULTS - kmod.KernelModuleTest.test_cryptodev: SKIPPED (0.00s)
RESULTS - maturin.MaturinDevelopTest.test_maturin_develop: SKIPPED (0.00s)
RESULTS - maturin.MaturinTest.test_maturin_list_python: SKIPPED (0.00s)
SUMMARY:
core-image-sato sdk (poky-glibc-x86_64-core-image-sato-riscv64imafdc_zicsr_zifencei-qemuriscv64-toolchain-6.1.99+snapshot.sh:environment-setup-riscv64imafdc_zicsr_zifencei-poky-linux) - Ran 21 tests in 1576.427s
core-image-sato sdk - OK - All required tests passed (successes=14, skipped=7, failures=0, errors=0)
NOTE: recipe core-image-sato-1.0-r0: task do_testsdk: Succeeded
Test run when enable usrmerge
Test requires gcc to be installed
Test requires g++ to be installed
Test requires g++ to be installed
Test requires make to be installed
Test requires python3-pygobject to be installed
Test requires cgo-helloworld to be installed
Test requires go-runtime-dev to be installed
Test requires go-runtime-dev to be installed
Test requires go-helloworld to be installed
Test requires gcc to be installed
Test requires ldd to be installed
Test requires logrotate to be installed
Test case logrotate.LogrotateTest.test_logrotate_newlog depends on logrotate.LogrotateTest.test_logrotate_wtmp but it didn't pass/run.
Test requires opkg to be installed
Test requires pam to be in DISTRO_FEATURES
Test requires ptest-runner to be installed
Test requires ptest-runner to be installed
GoCompileTest class: SDK doesn't contain a Go cross-canadian toolchain
GoCompileTest class: SDK doesn't contain a Go cross-canadian toolchain
GoHostCompileTest class: SDK doesn't contain a Go cross-canadian toolchain
GoHostCompileTest class: SDK doesn't contain a Go cross-canadian toolchain
gtk3.GTK3Test.test_libhandy does not support eSDK (https://bugzilla.yoctoproject.org/show_bug.cgi?id=15854)
kmod.KernelModuleTest.test_cryptodev does not support eSDK (https://bugzilla.yoctoproject.org/show_bug.cgi?id=15850)
GoCompileTest class: SDK doesn't contain a Go cross-canadian toolchain
GoCompileTest class: SDK doesn't contain a Go cross-canadian toolchain
GoHostCompileTest class: SDK doesn't contain a Go cross-canadian toolchain
GoHostCompileTest class: SDK doesn't contain a Go cross-canadian toolchain
gtk3.GTK3Test.test_libhandy does not support eSDK (https://bugzilla.yoctoproject.org/show_bug.cgi?id=15854)
kmod.KernelModuleTest.test_cryptodev does not support eSDK (https://bugzilla.yoctoproject.org/show_bug.cgi?id=15850)
Test requires rust-c-lib-example-bin to be installed
Test requires openssh-scp to be installed
Test requires openssh-scp to be installed
Test requires kernel-devsrc to be installed
systemd is not the init manager for this image
Test case systemd.SystemdBasicTests.test_systemd_failed depends on systemd.SystemdBasicTests.test_systemd_basic but it didn't pass/run.
Test case systemd.SystemdBasicTests.test_systemd_list depends on systemd.SystemdBasicTests.test_systemd_basic but it didn't pass/run.
Test case systemd.SystemdJournalTests.test_systemd_boot_time depends on systemd.SystemdBasicTests.test_systemd_basic but it didn't pass/run.
Test case systemd.SystemdJournalTests.test_systemd_journal depends on systemd.SystemdBasicTests.test_systemd_basic but it didn't pass/run.
Test requires minidebuginfo to be in DISTRO_FEATURES
Test case systemd.SystemdServiceTests.test_systemd_status depends on systemd.SystemdBasicTests.test_systemd_basic but it didn't pass/run.
Test case systemd.SystemdServiceTests.test_systemd_disable_enable depends on systemd.SystemdServiceTests.test_systemd_status but it didn't pass/run.
Test is only meant to run with read-only-rootfs in IMAGE_FEATURES
Test case systemd.SystemdServiceTests.test_systemd_stop_start depends on systemd.SystemdServiceTests.test_systemd_status but it didn't pass/run.
Test requires wayland-utils to be installed
Test requires weston to be installed
Test requires weston to be installed
Test requires weston to be installed
Output from runqemu:
runqemu - INFO - Received signal: 15
runqemu - INFO - Cleaning up
runqemu - INFO - Host uptime: 912051.61

runqemu - INFO - Removing /srv/pokybuild/yocto-worker/qemuriscv64/build/build/tmp/deploy/images/qemuriscv64/core-image-sato-qemuriscv64.rootfs-20261030010749.ext4
runqemu - INFO - Removing /home/pokybuild/tmp/core-image-sato-qemuriscv64.rootfs-20261030010749.ext4.2096422
tput: No value for $TERM and no -T specified

RESULTS:
RESULTS - connman.ConnmanTest.test_connmand_help: PASSED (1.55s)
RESULTS - connman.ConnmanTest.test_connmand_running: PASSED (1.53s)
RESULTS - date.DateTest.test_date: PASSED (4.95s)
RESULTS - df.DfTest.test_df: PASSED (1.34s)
RESULTS - dnf.DnfBasicTest.test_dnf_help: PASSED (224.45s)
RESULTS - dnf.DnfBasicTest.test_dnf_history: PASSED (56.60s)
RESULTS - dnf.DnfBasicTest.test_dnf_info: PASSED (97.77s)
RESULTS - dnf.DnfBasicTest.test_dnf_search: PASSED (43.06s)
RESULTS - dnf.DnfBasicTest.test_dnf_version: PASSED (42.06s)
RESULTS - dnf.DnfRepoTest.test_dnf_exclude: PASSED (258.04s)
RESULTS - dnf.DnfRepoTest.test_dnf_install: PASSED (137.37s)
RESULTS - dnf.DnfRepoTest.test_dnf_install_dependency: PASSED (202.34s)
RESULTS - dnf.DnfRepoTest.test_dnf_install_from_disk: PASSED (174.07s)
RESULTS - dnf.DnfRepoTest.test_dnf_install_from_http: PASSED (180.60s)
RESULTS - dnf.DnfRepoTest.test_dnf_installroot: PASSED (319.94s)
RESULTS - dnf.DnfRepoTest.test_dnf_makecache: PASSED (30.41s)
RESULTS - dnf.DnfRepoTest.test_dnf_reinstall: PASSED (51.28s)
RESULTS - dnf.DnfRepoTest.test_dnf_repoinfo: PASSED (38.25s)
RESULTS - oe_syslog.SyslogTest.test_syslog_running: PASSED (1.31s)
RESULTS - oe_syslog.SyslogTestConfig.test_syslog_logger: PASSED (3.29s)
RESULTS - oe_syslog.SyslogTestConfig.test_syslog_restart: PASSED (15.24s)
RESULTS - oe_syslog.SyslogTestConfig.test_syslog_startup_config: PASSED (33.50s)
RESULTS - parselogs.ParseLogsTest.test_get_context: PASSED (0.00s)
RESULTS - parselogs.ParseLogsTest.test_parselogs: PASSED (12.07s)
RESULTS - perl.PerlTest.test_perl_works: PASSED (1.63s)
RESULTS - ping.PingTest.test_ping: PASSED (0.14s)
RESULTS - python.PythonTest.test_python3: PASSED (3.45s)
RESULTS - rpm.RpmBasicTest.test_rpm_help: PASSED (1.59s)
RESULTS - rpm.RpmBasicTest.test_rpm_query: PASSED (3.41s)
RESULTS - rpm.RpmBasicTest.test_rpm_query_nonroot: PASSED (19.20s)
RESULTS - rpm.RpmInstallRemoveTest.test_check_rpm_install_removal_log_file_size: PASSED (106.63s)
RESULTS - rpm.RpmInstallRemoveTest.test_rpm_install: PASSED (7.34s)
RESULTS - rpm.RpmInstallRemoveTest.test_rpm_remove: PASSED (4.16s)
RESULTS - scp.ScpTest.test_scp_file: PASSED (10.55s)
RESULTS - ssh.SSHTest.test_ssh: PASSED (2.03s)
RESULTS - xorg.XorgTest.test_xorg_running: PASSED (12.25s)
RESULTS - apt.AptRepoTest.test_apt_install_from_repo: SKIPPED (0.00s)
RESULTS - buildcpio.BuildCpioTest.test_cpio: SKIPPED (0.00s)
RESULTS - buildgalculator.GalculatorTest.test_galculator: SKIPPED (0.00s)
RESULTS - buildlzip.BuildLzipTest.test_lzip: SKIPPED (0.00s)
RESULTS - dnf.DnfRepoTest.test_dnf_installroot_usrmerge: SKIPPED (0.00s)
RESULTS - gcc.GccCompileTest.test_gcc_compile: SKIPPED (0.00s)
RESULTS - gcc.GccCompileTest.test_gpp2_compile: SKIPPED (0.00s)
RESULTS - gcc.GccCompileTest.test_gpp_compile: SKIPPED (0.00s)
RESULTS - gcc.GccCompileTest.test_make: SKIPPED (0.00s)
RESULTS - gi.GObjectIntrospectionTest.test_python: SKIPPED (0.00s)
RESULTS - go.CgoHelloworldTest.test_cgohelloworld: SKIPPED (0.00s)
RESULTS - go.GoCompileTest.test_go_compile: SKIPPED (0.00s)
RESULTS - go.GoCompileTest.test_go_module: SKIPPED (0.00s)
RESULTS - go.GoHelloworldTest.test_gohelloworld: SKIPPED (0.00s)
RESULTS - kernelmodule.KernelModuleTest.test_kernel_module: SKIPPED (0.00s)
RESULTS - ldd.LddTest.test_ldd: SKIPPED (0.00s)
RESULTS - logrotate.LogrotateTest.test_logrotate_newlog: SKIPPED (0.00s)
RESULTS - logrotate.LogrotateTest.test_logrotate_wtmp: SKIPPED (0.00s)
RESULTS - opkg.OpkgRepoTest.test_opkg_install_from_repo: SKIPPED (0.00s)
RESULTS - pam.PamBasicTest.test_pam: SKIPPED (0.00s)
RESULTS - ptest.PtestRunnerTest.test_ptestrunner_expectfail: SKIPPED (0.00s)
RESULTS - ptest.PtestRunnerTest.test_ptestrunner_expectsuccess: SKIPPED (0.00s)
RESULTS - rust.RustCLibExampleTest.test_rust_c_lib_example: SKIPPED (0.00s)
RESULTS - rust.RustCompileTest.test_cargo_compile: SKIPPED (0.00s)
RESULTS - rust.RustCompileTest.test_rust_compile: SKIPPED (0.00s)
RESULTS - stap.StapTest.test_stap: SKIPPED (0.00s)
RESULTS - systemd.SystemdBasicTests.test_systemd_basic: SKIPPED (0.00s)
RESULTS - systemd.SystemdBasicTests.test_systemd_failed: SKIPPED (0.00s)
RESULTS - systemd.SystemdBasicTests.test_systemd_list: SKIPPED (0.00s)
RESULTS - systemd.SystemdJournalTests.test_systemd_boot_time: SKIPPED (0.00s)
RESULTS - systemd.SystemdJournalTests.test_systemd_journal: SKIPPED (0.00s)
RESULTS - systemd.SystemdServiceTests.test_systemd_coredump_minidebuginfo: SKIPPED (0.00s)
RESULTS - systemd.SystemdServiceTests.test_systemd_disable_enable: SKIPPED (0.00s)
RESULTS - systemd.SystemdServiceTests.test_systemd_disable_enable_ro: SKIPPED (0.00s)
RESULTS - systemd.SystemdServiceTests.test_systemd_status: SKIPPED (0.00s)
RESULTS - systemd.SystemdServiceTests.test_systemd_stop_start: SKIPPED (0.00s)
RESULTS - weston.WestonTest.test_wayland_info: SKIPPED (0.00s)
RESULTS - weston.WestonTest.test_weston_can_initialize_new_wayland_compositor: SKIPPED (0.00s)
RESULTS - weston.WestonTest.test_weston_running: SKIPPED (0.00s)
RESULTS - weston.WestonTest.test_weston_supports_xwayland: SKIPPED (0.00s)
SUMMARY:
core-image-sato () - Ran 76 tests in 2103.724s
core-image-sato - OK - All required tests passed (successes=36, skipped=40, failures=0, errors=0)
NOTE: recipe core-image-sato-1.0-r0: task do_testimage: Succeeded
Testing 'maturin develop' requires Rust cross-canadian in the SDK
meson.MesonTest.test_iputils does not support eSDK (https://bugzilla.yoctoproject.org/show_bug.cgi?id=15854)
Testing 'maturin develop' requires Rust cross-canadian in the SDK
RustCompileTest class: SDK doesn't contain a Rust cross-canadian toolchain
RustCompileTest class: SDK doesn't contain a Rust cross-canadian toolchain
meson.MesonTest.test_iputils does not support eSDK (https://bugzilla.yoctoproject.org/show_bug.cgi?id=15854)
RustCompileTest class: SDK doesn't contain a Rust cross-canadian toolchain
RustCompileTest class: SDK doesn't contain a Rust cross-canadian toolchain
Bitbake still alive (no events for 600s). Active tasks:
/srv/pokybuild/yocto-worker/qemuriscv64/build/layers/openembedded-core/meta/recipes-sato/images/core-image-sato.bb:do_testsdkext
/srv/pokybuild/yocto-worker/qemuriscv64/build/layers/openembedded-core/meta/recipes-sato/images/core-image-sato-sdk.bb:do_testimage
/srv/pokybuild/yocto-worker/qemuriscv64/build/layers/openembedded-core/meta/recipes-core/images/core-image-minimal.bb:do_testsdkext
Bitbake still alive (no events for 1200s). Active tasks:
/srv/pokybuild/yocto-worker/qemuriscv64/build/layers/openembedded-core/meta/recipes-sato/images/core-image-sato.bb:do_testsdkext
/srv/pokybuild/yocto-worker/qemuriscv64/build/layers/openembedded-core/meta/recipes-sato/images/core-image-sato-sdk.bb:do_testimage
/srv/pokybuild/yocto-worker/qemuriscv64/build/layers/openembedded-core/meta/recipes-core/images/core-image-minimal.bb:do_testsdkext
Bitbake still alive (no events for 1800s). Active tasks:
/srv/pokybuild/yocto-worker/qemuriscv64/build/layers/openembedded-core/meta/recipes-sato/images/core-image-sato.bb:do_testsdkext
/srv/pokybuild/yocto-worker/qemuriscv64/build/layers/openembedded-core/meta/recipes-sato/images/core-image-sato-sdk.bb:do_testimage
/srv/pokybuild/yocto-worker/qemuriscv64/build/layers/openembedded-core/meta/recipes-core/images/core-image-minimal.bb:do_testsdkext
Bitbake still alive (no events for 2400s). Active tasks:
/srv/pokybuild/yocto-worker/qemuriscv64/build/layers/openembedded-core/meta/recipes-sato/images/core-image-sato.bb:do_testsdkext
/srv/pokybuild/yocto-worker/qemuriscv64/build/layers/openembedded-core/meta/recipes-sato/images/core-image-sato-sdk.bb:do_testimage
/srv/pokybuild/yocto-worker/qemuriscv64/build/layers/openembedded-core/meta/recipes-core/images/core-image-minimal.bb:do_testsdkext
Test requires gtk+3 to be installed
RESULTS:
RESULTS - autotools.AutotoolsTest.test_cpio: PASSED (248.53s)
RESULTS - cmake.CMakeTest.test_assimp: PASSED (948.91s)
RESULTS - gcc.GccCompileTest.test_gcc_compile: PASSED (0.78s)
RESULTS - gcc.GccCompileTest.test_gpp2_compile: PASSED (0.77s)
RESULTS - gcc.GccCompileTest.test_gpp_compile: PASSED (2.32s)
RESULTS - gcc.GccCompileTest.test_make: PASSED (0.80s)
RESULTS - makefile.MakefileTest.test_lzip: PASSED (15.02s)
RESULTS - manifest.ManifestTest.test_manifests: PASSED (0.00s)
RESULTS - maturin.MaturinTest.test_maturin_list_python: PASSED (18.00s)
RESULTS - perl.PerlTest.test_perl: PASSED (0.11s)
RESULTS - python.Python3Test.test_python3: PASSED (13.49s)
RESULTS - devtool.DevtoolTest.test_devtool_add_reset: PASSED (54.69s)
RESULTS - devtool.DevtoolTest.test_devtool_build_cmake: PASSED (144.40s)
RESULTS - devtool.DevtoolTest.test_devtool_build_esdk_package: PASSED (124.54s)
RESULTS - devtool.DevtoolTest.test_devtool_build_make: PASSED (133.62s)
RESULTS - devtool.DevtoolTest.test_devtool_kernelmodule: PASSED (2865.95s)
RESULTS - devtool.DevtoolTest.test_devtool_location: PASSED (0.08s)
RESULTS - devtool.DevtoolTest.test_extend_autotools_recipe_creation: PASSED (480.35s)
RESULTS - devtool.DevtoolTest.test_recipes_for_nodejs: PASSED (89.61s)
RESULTS - devtool.SdkUpdateTest.test_sdk_update_http: PASSED (7.95s)
RESULTS - go.GoCompileTest.test_go_build: SKIPPED (0.00s)
RESULTS - go.GoCompileTest.test_go_module: SKIPPED (0.00s)
RESULTS - go.GoHostCompileTest.test_go_cross_compile: SKIPPED (0.00s)
RESULTS - go.GoHostCompileTest.test_go_module_cross_compile: SKIPPED (0.00s)
RESULTS - gtk3.GTK3Test.test_libhandy: SKIPPED (0.00s)
RESULTS - kmod.KernelModuleTest.test_cryptodev: SKIPPED (0.00s)
RESULTS - maturin.MaturinDevelopTest.test_maturin_develop: SKIPPED (117.49s)
RESULTS - meson.MesonTest.test_iputils: SKIPPED (0.00s)
RESULTS - rust.RustCompileTest.test_cargo_build: SKIPPED (0.00s)
RESULTS - rust.RustHostCompileTest.test_cargo_build: SKIPPED (0.00s)
SUMMARY:
core-image-minimal esdk (poky-glibc-x86_64-core-image-minimal-riscv64imafdc_zicsr_zifencei-qemuriscv64-toolchain-ext-6.1.99+snapshot.sh:environment-setup-riscv64imafdc_zicsr_zifencei-poky-linux) - Ran 30 tests in 5359.503s
core-image-minimal esdk - OK - All required tests passed (successes=20, skipped=10, failures=0, errors=0)
NOTE: recipe core-image-minimal-1.0-r0: task do_testsdkext: Succeeded
RESULTS:
RESULTS - autotools.AutotoolsTest.test_cpio: PASSED (246.61s)
RESULTS - cmake.CMakeTest.test_assimp: PASSED (947.85s)
RESULTS - gcc.GccCompileTest.test_gcc_compile: PASSED (0.77s)
RESULTS - gcc.GccCompileTest.test_gpp2_compile: PASSED (0.77s)
RESULTS - gcc.GccCompileTest.test_gpp_compile: PASSED (2.31s)
RESULTS - gcc.GccCompileTest.test_make: PASSED (0.80s)
RESULTS - makefile.MakefileTest.test_lzip: PASSED (15.03s)
RESULTS - manifest.ManifestTest.test_manifests: PASSED (0.00s)
RESULTS - maturin.MaturinTest.test_maturin_list_python: PASSED (17.87s)
RESULTS - perl.PerlTest.test_perl: PASSED (0.11s)
RESULTS - python.Python3Test.test_python3: PASSED (14.34s)
RESULTS - devtool.DevtoolTest.test_devtool_add_reset: PASSED (56.43s)
RESULTS - devtool.DevtoolTest.test_devtool_build_cmake: PASSED (147.93s)
RESULTS - devtool.DevtoolTest.test_devtool_build_esdk_package: PASSED (126.25s)
RESULTS - devtool.DevtoolTest.test_devtool_build_make: PASSED (136.84s)
RESULTS - devtool.DevtoolTest.test_devtool_kernelmodule: PASSED (2861.62s)
RESULTS - devtool.DevtoolTest.test_devtool_location: PASSED (0.08s)
RESULTS - devtool.DevtoolTest.test_extend_autotools_recipe_creation: PASSED (466.06s)
RESULTS - devtool.DevtoolTest.test_recipes_for_nodejs: PASSED (88.08s)
RESULTS - devtool.SdkUpdateTest.test_sdk_update_http: PASSED (8.07s)
RESULTS - go.GoCompileTest.test_go_build: SKIPPED (0.00s)
RESULTS - go.GoCompileTest.test_go_module: SKIPPED (0.00s)
RESULTS - go.GoHostCompileTest.test_go_cross_compile: SKIPPED (0.00s)
RESULTS - go.GoHostCompileTest.test_go_module_cross_compile: SKIPPED (0.00s)
RESULTS - gtk3.GTK3Test.test_libhandy: SKIPPED (0.00s)
RESULTS - kmod.KernelModuleTest.test_cryptodev: SKIPPED (0.00s)
RESULTS - maturin.MaturinDevelopTest.test_maturin_develop: SKIPPED (118.51s)
RESULTS - meson.MesonTest.test_iputils: SKIPPED (0.00s)
RESULTS - rust.RustCompileTest.test_cargo_build: SKIPPED (0.00s)
RESULTS - rust.RustHostCompileTest.test_cargo_build: SKIPPED (0.00s)
SUMMARY:
core-image-sato esdk (poky-glibc-x86_64-core-image-sato-riscv64imafdc_zicsr_zifencei-qemuriscv64-toolchain-ext-6.1.99+snapshot.sh:environment-setup-riscv64imafdc_zicsr_zifencei-poky-linux) - Ran 30 tests in 5350.848s
core-image-sato esdk - OK - All required tests passed (successes=20, skipped=10, failures=0, errors=0)
NOTE: recipe core-image-sato-1.0-r0: task do_testsdkext: Succeeded
Bitbake still alive (no events for 600s). Active tasks:
/srv/pokybuild/yocto-worker/qemuriscv64/build/layers/openembedded-core/meta/recipes-sato/images/core-image-sato-sdk.bb:do_testimage
Bitbake still alive (no events for 1200s). Active tasks:
/srv/pokybuild/yocto-worker/qemuriscv64/build/layers/openembedded-core/meta/recipes-sato/images/core-image-sato-sdk.bb:do_testimage
Test run when enable usrmerge
Bitbake still alive (no events for 600s). Active tasks:
/srv/pokybuild/yocto-worker/qemuriscv64/build/layers/openembedded-core/meta/recipes-sato/images/core-image-sato-sdk.bb:do_testimage
Traceback (most recent call last):
  File "/srv/pokybuild/yocto-worker/qemuriscv64/build/layers/openembedded-core/meta/lib/oeqa/core/decorator/__init__.py", line 35, in wrapped_f
    return func(*args, **kwargs)
  File "/srv/pokybuild/yocto-worker/qemuriscv64/build/layers/openembedded-core/meta/lib/oeqa/core/decorator/__init__.py", line 35, in wrapped_f
    return func(*args, **kwargs)
  File "/srv/pokybuild/yocto-worker/qemuriscv64/build/layers/openembedded-core/meta/lib/oeqa/core/decorator/__init__.py", line 35, in wrapped_f
    return func(*args, **kwargs)
  [Previous line repeated 1 more time]
  File "/srv/pokybuild/yocto-worker/qemuriscv64/build/layers/openembedded-core/meta/lib/oeqa/runtime/cases/go.py", line 38, in test_go_compile
    status, output = self.target.run('go build -o /tmp/test /tmp/test.go', 600)
                     ~~~~~~~~~~~~~~~^^^^^^^^^^^^^^^^^^^^^^^^^^^^^^^^^^^^^^^^^^^
  File "/srv/pokybuild/yocto-worker/qemuriscv64/build/layers/openembedded-core/meta/lib/oeqa/core/target/ssh.py", line 98, in run
    status, output = self._run(sshCmd, processTimeout, ignore_status, raw, ignore_ssh_fails)
                     ~~~~~~~~~^^^^^^^^^^^^^^^^^^^^^^^^^^^^^^^^^^^^^^^^^^^^^^^^^^^^^^^^^^^^^^
  File "/srv/pokybuild/yocto-worker/qemuriscv64/build/layers/openembedded-core/meta/lib/oeqa/core/target/ssh.py", line 70, in _run
    raise AssertionError("ssh exited with status '255' for command "
                         "'%s': this is likely an SSH failure\n%s"
                         % (command, output))
AssertionError: ssh exited with status '255' for command '['ssh', '-l', 'root', '-o', 'ServerAliveCountMax=2', '-o', 'ServerAliveInterval=30', '-o', 'UserKnownHostsFile=/dev/null', '-o', 'StrictHostKeyChecking=no', '-o', 'LogLevel=ERROR', '192.168.7.6', 'export PATH=/usr/sbin:/sbin:/usr/bin:/bin; go build -o /tmp/test /tmp/test.go']': this is likely an SSH failure

Process killed - no output for 600 seconds. Total running time: 605 seconds.

Bitbake still alive (no events for 600s). Active tasks:
/srv/pokybuild/yocto-worker/qemuriscv64/build/layers/openembedded-core/meta/recipes-sato/images/core-image-sato-sdk.bb:do_testimage
Bitbake still alive (no events for 1200s). Active tasks:
/srv/pokybuild/yocto-worker/qemuriscv64/build/layers/openembedded-core/meta/recipes-sato/images/core-image-sato-sdk.bb:do_testimage
Bitbake still alive (no events for 1800s). Active tasks:
/srv/pokybuild/yocto-worker/qemuriscv64/build/layers/openembedded-core/meta/recipes-sato/images/core-image-sato-sdk.bb:do_testimage
Bitbake still alive (no events for 2400s). Active tasks:
/srv/pokybuild/yocto-worker/qemuriscv64/build/layers/openembedded-core/meta/recipes-sato/images/core-image-sato-sdk.bb:do_testimage
Bitbake still alive (no events for 3000s). Active tasks:
/srv/pokybuild/yocto-worker/qemuriscv64/build/layers/openembedded-core/meta/recipes-sato/images/core-image-sato-sdk.bb:do_testimage
Test requires opkg to be installed
Test requires pam to be in DISTRO_FEATURES
Test requires ptest-runner to be installed
Test requires ptest-runner to be installed
Test requires rust-c-lib-example-bin to be installed
Bitbake still alive (no events for 600s). Active tasks:
/srv/pokybuild/yocto-worker/qemuriscv64/build/layers/openembedded-core/meta/recipes-sato/images/core-image-sato-sdk.bb:do_testimage
systemd is not the init manager for this image
Test case systemd.SystemdBasicTests.test_systemd_failed depends on systemd.SystemdBasicTests.test_systemd_basic but it didn't pass/run.
Test case systemd.SystemdBasicTests.test_systemd_list depends on systemd.SystemdBasicTests.test_systemd_basic but it didn't pass/run.
Test case systemd.SystemdJournalTests.test_systemd_boot_time depends on systemd.SystemdBasicTests.test_systemd_basic but it didn't pass/run.
Test case systemd.SystemdJournalTests.test_systemd_journal depends on systemd.SystemdBasicTests.test_systemd_basic but it didn't pass/run.
Test requires minidebuginfo to be in DISTRO_FEATURES
Test case systemd.SystemdServiceTests.test_systemd_status depends on systemd.SystemdBasicTests.test_systemd_basic but it didn't pass/run.
Test case systemd.SystemdServiceTests.test_systemd_disable_enable depends on systemd.SystemdServiceTests.test_systemd_status but it didn't pass/run.
Test is only meant to run with read-only-rootfs in IMAGE_FEATURES
Test case systemd.SystemdServiceTests.test_systemd_stop_start depends on systemd.SystemdServiceTests.test_systemd_status but it didn't pass/run.
Test requires wayland-utils to be installed
Test requires weston to be installed
Test requires weston to be installed
Test requires weston to be installed
Output from runqemu:
runqemu - INFO - Received signal: 15
runqemu - INFO - Cleaning up
runqemu - INFO - Host uptime: 924914.22

runqemu - INFO - Removing /srv/pokybuild/yocto-worker/qemuriscv64/build/build/tmp/deploy/images/qemuriscv64/core-image-sato-sdk-qemuriscv64.rootfs-20261030010749.ext4
runqemu - INFO - Removing /home/pokybuild/tmp/core-image-sato-sdk-qemuriscv64.rootfs-20261030010749.ext4.2096427
tput: No value for $TERM and no -T specified

RESULTS:
RESULTS - buildcpio.BuildCpioTest.test_cpio: PASSED (5401.82s)
RESULTS - buildlzip.BuildLzipTest.test_lzip: PASSED (2002.35s)
RESULTS - connman.ConnmanTest.test_connmand_help: PASSED (2.06s)
RESULTS - connman.ConnmanTest.test_connmand_running: PASSED (2.48s)
RESULTS - date.DateTest.test_date: PASSED (7.16s)
RESULTS - df.DfTest.test_df: PASSED (1.92s)
RESULTS - dnf.DnfBasicTest.test_dnf_help: PASSED (102.77s)
RESULTS - dnf.DnfBasicTest.test_dnf_history: PASSED (49.25s)
RESULTS - dnf.DnfBasicTest.test_dnf_info: PASSED (39.51s)
RESULTS - dnf.DnfBasicTest.test_dnf_search: PASSED (40.26s)
RESULTS - dnf.DnfBasicTest.test_dnf_version: PASSED (37.64s)
RESULTS - dnf.DnfRepoTest.test_dnf_exclude: PASSED (145.54s)
RESULTS - dnf.DnfRepoTest.test_dnf_install: PASSED (130.84s)
RESULTS - dnf.DnfRepoTest.test_dnf_install_dependency: PASSED (163.37s)
RESULTS - dnf.DnfRepoTest.test_dnf_install_from_disk: PASSED (170.03s)
RESULTS - dnf.DnfRepoTest.test_dnf_install_from_http: PASSED (132.76s)
RESULTS - dnf.DnfRepoTest.test_dnf_installroot: PASSED (293.45s)
RESULTS - dnf.DnfRepoTest.test_dnf_makecache: PASSED (30.02s)
RESULTS - dnf.DnfRepoTest.test_dnf_reinstall: PASSED (59.38s)
RESULTS - dnf.DnfRepoTest.test_dnf_repoinfo: PASSED (40.63s)
RESULTS - gcc.GccCompileTest.test_gcc_compile: PASSED (19.15s)
RESULTS - gcc.GccCompileTest.test_gpp2_compile: PASSED (20.45s)
RESULTS - gcc.GccCompileTest.test_gpp_compile: PASSED (70.19s)
RESULTS - gcc.GccCompileTest.test_make: PASSED (17.24s)
RESULTS - gi.GObjectIntrospectionTest.test_python: PASSED (20.77s)
RESULTS - go.CgoHelloworldTest.test_cgohelloworld: PASSED (2.28s)
RESULTS - go.GoCompileTest.test_go_module: PASSED (270.42s)
RESULTS - go.GoHelloworldTest.test_gohelloworld: PASSED (2.41s)
RESULTS - kernelmodule.KernelModuleTest.test_kernel_module: PASSED (3336.15s)
RESULTS - ldd.LddTest.test_ldd: PASSED (5.90s)
RESULTS - logrotate.LogrotateTest.test_logrotate_newlog: PASSED (16.40s)
RESULTS - logrotate.LogrotateTest.test_logrotate_wtmp: PASSED (10.14s)
RESULTS - oe_syslog.SyslogTest.test_syslog_running: PASSED (2.39s)
RESULTS - oe_syslog.SyslogTestConfig.test_syslog_logger: PASSED (4.53s)
RESULTS - oe_syslog.SyslogTestConfig.test_syslog_restart: PASSED (18.46s)
RESULTS - oe_syslog.SyslogTestConfig.test_syslog_startup_config: PASSED (43.78s)
RESULTS - parselogs.ParseLogsTest.test_get_context: PASSED (0.00s)
RESULTS - parselogs.ParseLogsTest.test_parselogs: PASSED (20.31s)
RESULTS - perl.PerlTest.test_perl_works: PASSED (2.20s)
RESULTS - ping.PingTest.test_ping: PASSED (0.18s)
RESULTS - python.PythonTest.test_python3: PASSED (4.17s)
RESULTS - rpm.RpmBasicTest.test_rpm_help: PASSED (2.24s)
RESULTS - rpm.RpmBasicTest.test_rpm_query: PASSED (4.97s)
RESULTS - rpm.RpmBasicTest.test_rpm_query_nonroot: PASSED (36.04s)
RESULTS - rpm.RpmInstallRemoveTest.test_check_rpm_install_removal_log_file_size: PASSED (218.89s)
RESULTS - rpm.RpmInstallRemoveTest.test_rpm_install: PASSED (17.16s)
RESULTS - rpm.RpmInstallRemoveTest.test_rpm_remove: PASSED (8.01s)
RESULTS - rust.RustCompileTest.test_cargo_compile: PASSED (59.85s)
RESULTS - rust.RustCompileTest.test_rust_compile: PASSED (29.55s)
RESULTS - scp.ScpTest.test_scp_file: PASSED (13.64s)
RESULTS - ssh.SSHTest.test_ssh: PASSED (5.63s)
RESULTS - stap.StapTest.test_stap: PASSED (1047.36s)
RESULTS - xorg.XorgTest.test_xorg_running: PASSED (9.62s)
RESULTS - apt.AptRepoTest.test_apt_install_from_repo: SKIPPED (0.00s)
RESULTS - buildgalculator.GalculatorTest.test_galculator: SKIPPED (0.00s)
RESULTS - dnf.DnfRepoTest.test_dnf_installroot_usrmerge: SKIPPED (0.00s)
RESULTS - opkg.OpkgRepoTest.test_opkg_install_from_repo: SKIPPED (0.00s)
RESULTS - pam.PamBasicTest.test_pam: SKIPPED (0.00s)
RESULTS - ptest.PtestRunnerTest.test_ptestrunner_expectfail: SKIPPED (0.00s)
RESULTS - ptest.PtestRunnerTest.test_ptestrunner_expectsuccess: SKIPPED (0.00s)
RESULTS - rust.RustCLibExampleTest.test_rust_c_lib_example: SKIPPED (0.00s)
RESULTS - systemd.SystemdBasicTests.test_systemd_basic: SKIPPED (0.00s)
RESULTS - systemd.SystemdBasicTests.test_systemd_failed: SKIPPED (0.00s)
RESULTS - systemd.SystemdBasicTests.test_systemd_list: SKIPPED (0.00s)
RESULTS - systemd.SystemdJournalTests.test_systemd_boot_time: SKIPPED (0.00s)
RESULTS - systemd.SystemdJournalTests.test_systemd_journal: SKIPPED (0.00s)
RESULTS - systemd.SystemdServiceTests.test_systemd_coredump_minidebuginfo: SKIPPED (0.00s)
RESULTS - systemd.SystemdServiceTests.test_systemd_disable_enable: SKIPPED (0.00s)
RESULTS - systemd.SystemdServiceTests.test_systemd_disable_enable_ro: SKIPPED (0.00s)
RESULTS - systemd.SystemdServiceTests.test_systemd_status: SKIPPED (0.00s)
RESULTS - systemd.SystemdServiceTests.test_systemd_stop_start: SKIPPED (0.00s)
RESULTS - weston.WestonTest.test_wayland_info: SKIPPED (0.00s)
RESULTS - weston.WestonTest.test_weston_can_initialize_new_wayland_compositor: SKIPPED (0.00s)
RESULTS - weston.WestonTest.test_weston_running: SKIPPED (0.00s)
RESULTS - weston.WestonTest.test_weston_supports_xwayland: SKIPPED (0.00s)
RESULTS - go.GoCompileTest.test_go_compile: FAILED (626.13s)
SUMMARY:
core-image-sato-sdk () - Ran 76 tests in 14827.250s
core-image-sato-sdk - FAIL - Required tests failed (successes=53, skipped=22, failures=1, errors=0)
core-image-sato-sdk - FAILED - Last lines of QEMU boot logs:
--- qemu_boot_log.20261030081756 ---
matchbox: ignoring key shortcut XF86Calendar=!$contacts

matchbox: Cant find a keycode for keysym 2809
matchbox: ignoring key shortcut telephone=!$dates

matchbox: Cant find a keycode for keysym 269025050
matchbox: ignoring key shortcut XF86Start=!matchbox-remote -desktop

[settings daemon] Forking. run with -n to prevent fork
dbus-daemon[708]: Activating service name='org.a11y.atspi.Registry' requested by ':1.2' (uid=0 pid=685 comm="connman-applet")
matchbox-wm: X error warning (0xc00002): BadWindow (invalid Window parameter) (opcode: 12)
dbus-daemon[708]: Successfully activated service 'org.a11y.atspi.Registry'
SpiRegistry daemon is running with well-known name - org.a11y.atspi.Registry

** (at-spi2-registryd:725): WARNING **: 08:23:25.068: Disabling unresponsive app with pid 704

** (at-spi2-registryd:725): WARNING **: 08:24:22.966: Re-enabling app with pid 704
[13377.775493] hellomod: loading out-of-tree module taints kernel.
[13377.889522] Hello world!
[13383.545842] Cleaning up hellomod.

--- qemu_boot_log.20261030081756.2 ---

[ ok ]

pci id for fd 11: 1234:1111, driver (null)

pci id for fd 12: 1234:1111, driver (null)

Starting Telephony daemon

Starting crond: OK



Poky (Yocto Project Reference Distro) 6.1.99+snapshot-b62d5e681741394ad90501a83a1c66b0e3ab7ce3 qemuriscv64 ttyS0

Type 'root' to login with superuser privileges (no password will be asked).

qemuriscv64 login: [13377.775493] hellomod: loading out-of-tree module taints kernel.
[13377.889522] Hello world!
[13383.545842] Cleaning up hellomod.

ERROR: core-image-sato-sdk-1.0-r0 do_testimage: core-image-sato-sdk - FAILED - also check the logs in /srv/pokybuild/yocto-worker/qemuriscv64/build/build/tmp/log
NOTE: recipe core-image-sato-sdk-1.0-r0: task do_testimage: Succeeded
NOTE: Tasks Summary: Attempted 1552 tasks of which 1546 didn't need to be rerun and all succeeded.
NOTE: Writing buildhistory
NOTE: Writing buildhistory took: 15 seconds

Summary: There was 1 ERROR message, returning a non-zero exit code.

Error details

Submitted on:
30/10/26 09:39
Error type:
Core
Command:
bitbake core-image-minimal:do_testimage core-image-sato:do_testimage core-image-sato-sdk:do_testimage core-image-sato:do_testsdk core-image-minimal:do_testsdkext core-image-sato:do_testsdkext -k
Machine:
qemuriscv64
Distro:
poky
Build system:
unknown
Target system:
unknown
Host distro:
unknown
Branch:
master
Commit:
unknown
Build:
#253584
Submitter:
yp-ab-ubuntu2604-vk-4
Link back:
https://autobuilder.yoctoproject.org/valkyrie/#/builders/45/builds/2621
Similar errors:
0
Open a bug