DEBUG: Executing shell function do_compile
ninja: Entering directory `TOPDIR/tmp/work/x86_64-linux/gn-native/0+git/build'
[1/216] g++ -MMD -MF src/base/files/file_path_constants.o.d -I../sources/gn-0+git/src -I../sources/gn-0+git/src/gn/starlark/vendor/cxx/include -I. -isystemTOPDIR/tmp/work/x86_64-linux/gn-native/0+git/recipe-sysroot-native/usr/include -O2 -pipe -Wno-error=maybe-uninitialized -isystemTOPDIR/tmp/work/x86_64-linux/gn-native/0+git/recipe-sysroot-native/usr/include -O2 -pipe -fvisibility-inlines-hidden -DNDEBUG -O3 -g -fdata-sections -ffunction-sections -D_FILE_OFFSET_BITS=64 -D__STDC_CONSTANT_MACROS -D__STDC_FORMAT_MACROS -pthread -pipe -fno-exceptions -fno-rtti -fdiagnostics-color -Wall -Wextra -Wno-unused-parameter -Wextra-semi -Wundef -std=c++23 -Wno-redundant-move -Wno-restrict -Wno-deprecated-copy -Wno-implicit-fallthrough -Wno-redundant-move -Wno-unused-variable -Wno-format -Wno-strict-aliasing -Wno-cast-function-type -c ../sources/gn-0+git/src/base/files/file_path_constants.cc -o src/base/files/file_path_constants.o
[2/216] g++ -MMD -MF src/base/json/string_escape.o.d -I../sources/gn-0+git/src -I../sources/gn-0+git/src/gn/starlark/vendor/cxx/include -I. -isystemTOPDIR/tmp/work/x86_64-linux/gn-native/0+git/recipe-sysroot-native/usr/include -O2 -pipe -Wno-error=maybe-uninitialized -isystemTOPDIR/tmp/work/x86_64-linux/gn-native/0+git/recipe-sysroot-native/usr/include -O2 -pipe -fvisibility-inlines-hidden -DNDEBUG -O3 -g -fdata-sections -ffunction-sections -D_FILE_OFFSET_BITS=64 -D__STDC_CONSTANT_MACROS -D__STDC_FORMAT_MACROS -pthread -pipe -fno-exceptions -fno-rtti -fdiagnostics-color -Wall -Wextra -Wno-unused-parameter -Wextra-semi -Wundef -std=c++23 -Wno-redundant-move -Wno-restrict -Wno-deprecated-copy -Wno-implicit-fallthrough -Wno-redundant-move -Wno-unused-variable -Wno-format -Wno-strict-aliasing -Wno-cast-function-type -c ../sources/gn-0+git/src/base/json/string_escape.cc -o src/base/json/string_escape.o
[3/216] g++ -MMD -MF src/base/md5.o.d -I../sources/gn-0+git/src -I../sources/gn-0+git/src/gn/starlark/vendor/cxx/include -I. -isystemTOPDIR/tmp/work/x86_64-linux/gn-native/0+git/recipe-sysroot-native/usr/include -O2 -pipe -Wno-error=maybe-uninitialized -isystemTOPDIR/tmp/work/x86_64-linux/gn-native/0+git/recipe-sysroot-native/usr/include -O2 -pipe -fvisibility-inlines-hidden -DNDEBUG -O3 -g -fdata-sections -ffunction-sections -D_FILE_OFFSET_BITS=64 -D__STDC_CONSTANT_MACROS -D__STDC_FORMAT_MACROS -pthread -pipe -fno-exceptions -fno-rtti -fdiagnostics-color -Wall -Wextra -Wno-unused-parameter -Wextra-semi -Wundef -std=c++23 -Wno-redundant-move -Wno-restrict -Wno-deprecated-copy -Wno-implicit-fallthrough -Wno-redundant-move -Wno-unused-variable -Wno-format -Wno-strict-aliasing -Wno-cast-function-type -c ../sources/gn-0+git/src/base/md5.cc -o src/base/md5.o
[4/216] g++ -MMD -MF src/base/memory/ref_counted.o.d -I../sources/gn-0+git/src -I../sources/gn-0+git/src/gn/starlark/vendor/cxx/include -I. -isystemTOPDIR/tmp/work/x86_64-linux/gn-native/0+git/recipe-sysroot-native/usr/include -O2 -pipe -Wno-error=maybe-uninitialized -isystemTOPDIR/tmp/work/x86_64-linux/gn-native/0+git/recipe-sysroot-native/usr/include -O2 -pipe -fvisibility-inlines-hidden -DNDEBUG -O3 -g -fdata-sections -ffunction-sections -D_FILE_OFFSET_BITS=64 -D__STDC_CONSTANT_MACROS -D__STDC_FORMAT_MACROS -pthread -pipe -fno-exceptions -fno-rtti -fdiagnostics-color -Wall -Wextra -Wno-unused-parameter -Wextra-semi -Wundef -std=c++23 -Wno-redundant-move -Wno-restrict -Wno-deprecated-copy -Wno-implicit-fallthrough -Wno-redundant-move -Wno-unused-variable -Wno-format -Wno-strict-aliasing -Wno-cast-function-type -c ../sources/gn-0+git/src/base/memory/ref_counted.cc -o src/base/memory/ref_counted.o
[5/216] g++ -MMD -MF src/base/memory/weak_ptr.o.d -I../sources/gn-0+git/src -I../sources/gn-0+git/src/gn/starlark/vendor/cxx/include -I. -isystemTOPDIR/tmp/work/x86_64-linux/gn-native/0+git/recipe-sysroot-native/usr/include -O2 -pipe -Wno-error=maybe-uninitialized -isystemTOPDIR/tmp/work/x86_64-linux/gn-native/0+git/recipe-sysroot-native/usr/include -O2 -pipe -fvisibility-inlines-hidden -DNDEBUG -O3 -g -fdata-sections -ffunction-sections -D_FILE_OFFSET_BITS=64 -D__STDC_CONSTANT_MACROS -D__STDC_FORMAT_MACROS -pthread -pipe -fno-exceptions -fno-rtti -fdiagnostics-color -Wall -Wextra -Wno-unused-parameter -Wextra-semi -Wundef -std=c++23 -Wno-redundant-move -Wno-restrict -Wno-deprecated-copy -Wno-implicit-fallthrough -Wno-redundant-move -Wno-unused-variable -Wno-format -Wno-strict-aliasing -Wno-cast-function-type -c ../sources/gn-0+git/src/base/memory/weak_ptr.cc -o src/base/memory/weak_ptr.o
[6/216] g++ -MMD -MF src/base/sha1.o.d -I../sources/gn-0+git/src -I../sources/gn-0+git/src/gn/starlark/vendor/cxx/include -I. -isystemTOPDIR/tmp/work/x86_64-linux/gn-native/0+git/recipe-sysroot-native/usr/include -O2 -pipe -Wno-error=maybe-uninitialized -isystemTOPDIR/tmp/work/x86_64-linux/gn-native/0+git/recipe-sysroot-native/usr/include -O2 -pipe -fvisibility-inlines-hidden -DNDEBUG -O3 -g -fdata-sections -ffunction-sections -D_FILE_OFFSET_BITS=64 -D__STDC_CONSTANT_MACROS -D__STDC_FORMAT_MACROS -pthread -pipe -fno-exceptions -fno-rtti -fdiagnostics-color -Wall -Wextra -Wno-unused-parameter -Wextra-semi -Wundef -std=c++23 -Wno-redundant-move -Wno-restrict -Wno-deprecated-copy -Wno-implicit-fallthrough -Wno-redundant-move -Wno-unused-variable -Wno-format -Wno-strict-aliasing -Wno-cast-function-type -c ../sources/gn-0+git/src/base/sha1.cc -o src/base/sha1.o
[7/216] g++ -MMD -MF src/base/strings/string_util_constants.o.d -I../sources/gn-0+git/src -I../sources/gn-0+git/src/gn/starlark/vendor/cxx/include -I. -isystemTOPDIR/tmp/work/x86_64-linux/gn-native/0+git/recipe-sysroot-native/usr/include -O2 -pipe -Wno-error=maybe-uninitialized -isystemTOPDIR/tmp/work/x86_64-linux/gn-native/0+git/recipe-sysroot-native/usr/include -O2 -pipe -fvisibility-inlines-hidden -DNDEBUG -O3 -g -fdata-sections -ffunction-sections -D_FILE_OFFSET_BITS=64 -D__STDC_CONSTANT_MACROS -D__STDC_FORMAT_MACROS -pthread -pipe -fno-exceptions -fno-rtti -fdiagnostics-color -Wall -Wextra -Wno-unused-parameter -Wextra-semi -Wundef -std=c++23 -Wno-redundant-move -Wno-restrict -Wno-deprecated-copy -Wno-implicit-fallthrough -Wno-redundant-move -Wno-unused-variable -Wno-format -Wno-strict-aliasing -Wno-cast-function-type -c ../sources/gn-0+git/src/base/strings/string_util_constants.cc -o src/base/strings/string_util_constants.o
[8/216] g++ -MMD -MF src/base/timer/elapsed_timer.o.d -I../sources/gn-0+git/src -I../sources/gn-0+git/src/gn/starlark/vendor/cxx/include -I. -isystemTOPDIR/tmp/work/x86_64-linux/gn-native/0+git/recipe-sysroot-native/usr/include -O2 -pipe -Wno-error=maybe-uninitialized -isystemTOPDIR/tmp/work/x86_64-linux/gn-native/0+git/recipe-sysroot-native/usr/include -O2 -pipe -fvisibility-inlines-hidden -DNDEBUG -O3 -g -fdata-sections -ffunction-sections -D_FILE_OFFSET_BITS=64 -D__STDC_CONSTANT_MACROS -D__STDC_FORMAT_MACROS -pthread -pipe -fno-exceptions -fno-rtti -fdiagnostics-color -Wall -Wextra -Wno-unused-parameter -Wextra-semi -Wundef -std=c++23 -Wno-redundant-move -Wno-restrict -Wno-deprecated-copy -Wno-implicit-fallthrough -Wno-redundant-move -Wno-unused-variable -Wno-format -Wno-strict-aliasing -Wno-cast-function-type -c ../sources/gn-0+git/src/base/timer/elapsed_timer.cc -o src/base/timer/elapsed_timer.o
[9/216] g++ -MMD -MF src/base/files/file_path_posix.o.d -I../sources/gn-0+git/src -I../sources/gn-0+git/src/gn/starlark/vendor/cxx/include -I. -isystemTOPDIR/tmp/work/x86_64-linux/gn-native/0+git/recipe-sysroot-native/usr/include -O2 -pipe -Wno-error=maybe-uninitialized -isystemTOPDIR/tmp/work/x86_64-linux/gn-native/0+git/recipe-sysroot-native/usr/include -O2 -pipe -fvisibility-inlines-hidden -DNDEBUG -O3 -g -fdata-sections -ffunction-sections -D_FILE_OFFSET_BITS=64 -D__STDC_CONSTANT_MACROS -D__STDC_FORMAT_MACROS -pthread -pipe -fno-exceptions -fno-rtti -fdiagnostics-color -Wall -Wextra -Wno-unused-parameter -Wextra-semi -Wundef -std=c++23 -Wno-redundant-move -Wno-restrict -Wno-deprecated-copy -Wno-implicit-fallthrough -Wno-redundant-move -Wno-unused-variable -Wno-format -Wno-strict-aliasing -Wno-cast-function-type -c ../sources/gn-0+git/src/base/files/file_path_posix.cc -o src/base/files/file_path_posix.o
[10/216] g++ -MMD -MF src/base/posix/file_descriptor_shuffle.o.d -I../sources/gn-0+git/src -I../sources/gn-0+git/src/gn/starlark/vendor/cxx/include -I. -isystemTOPDIR/tmp/work/x86_64-linux/gn-native/0+git/recipe-sysroot-native/usr/include -O2 -pipe -Wno-error=maybe-uninitialized -isystemTOPDIR/tmp/work/x86_64-linux/gn-native/0+git/recipe-sysroot-native/usr/include -O2 -pipe -fvisibility-inlines-hidden -DNDEBUG -O3 -g -fdata-sections -ffunction-sections -D_FILE_OFFSET_BITS=64 -D__STDC_CONSTANT_MACROS -D__STDC_FORMAT_MACROS -pthread -pipe -fno-exceptions -fno-rtti -fdiagnostics-color -Wall -Wextra -Wno-unused-parameter -Wextra-semi -Wundef -std=c++23 -Wno-redundant-move -Wno-restrict -Wno-deprecated-copy -Wno-implicit-fallthrough -Wno-redundant-move -Wno-unused-variable -Wno-format -Wno-strict-aliasing -Wno-cast-function-type -c ../sources/gn-0+git/src/base/posix/file_descriptor_shuffle.cc -o src/base/posix/file_descriptor_shuffle.o
[11/216] g++ -MMD -MF src/base/posix/safe_strerror.o.d -I../sources/gn-0+git/src -I../sources/gn-0+git/src/gn/starlark/vendor/cxx/include -I. -isystemTOPDIR/tmp/work/x86_64-linux/gn-native/0+git/recipe-sysroot-native/usr/include -O2 -pipe -Wno-error=maybe-uninitialized -isystemTOPDIR/tmp/work/x86_64-linux/gn-native/0+git/recipe-sysroot-native/usr/include -O2 -pipe -fvisibility-inlines-hidden -DNDEBUG -O3 -g -fdata-sections -ffunction-sections -D_FILE_OFFSET_BITS=64 -D__STDC_CONSTANT_MACROS -D__STDC_FORMAT_MACROS -pthread -pipe -fno-exceptions -fno-rtti -fdiagnostics-color -Wall -Wextra -Wno-unused-parameter -Wextra-semi -Wundef -std=c++23 -Wno-redundant-move -Wno-restrict -Wno-deprecated-copy -Wno-implicit-fallthrough -Wno-redundant-move -Wno-unused-variable -Wno-format -Wno-strict-aliasing -Wno-cast-function-type -c ../sources/gn-0+git/src/base/posix/safe_strerror.cc -o src/base/posix/safe_strerror.o
[12/216] g++ -MMD -MF src/base/files/scoped_file.o.d -I../sources/gn-0+git/src -I../sources/gn-0+git/src/gn/starlark/vendor/cxx/include -I. -isystemTOPDIR/tmp/work/x86_64-linux/gn-native/0+git/recipe-sysroot-native/usr/include -O2 -pipe -Wno-error=maybe-uninitialized -isystemTOPDIR/tmp/work/x86_64-linux/gn-native/0+git/recipe-sysroot-native/usr/include -O2 -pipe -fvisibility-inlines-hidden -DNDEBUG -O3 -g -fdata-sections -ffunction-sections -D_FILE_OFFSET_BITS=64 -D__STDC_CONSTANT_MACROS -D__STDC_FORMAT_MACROS -pthread -pipe -fno-exceptions -fno-rtti -fdiagnostics-color -Wall -Wextra -Wno-unused-parameter -Wextra-semi -Wundef -std=c++23 -Wno-redundant-move -Wno-restrict -Wno-deprecated-copy -Wno-implicit-fallthrough -Wno-redundant-move -Wno-unused-variable -Wno-format -Wno-strict-aliasing -Wno-cast-function-type -c ../sources/gn-0+git/src/base/files/scoped_file.cc -o src/base/files/scoped_file.o
[13/216] g++ -MMD -MF src/base/sha2.o.d -I../sources/gn-0+git/src -I../sources/gn-0+git/src/gn/starlark/vendor/cxx/include -I. -isystemTOPDIR/tmp/work/x86_64-linux/gn-native/0+git/recipe-sysroot-native/usr/include -O2 -pipe -Wno-error=maybe-uninitialized -isystemTOPDIR/tmp/work/x86_64-linux/gn-native/0+git/recipe-sysroot-native/usr/include -O2 -pipe -fvisibility-inlines-hidden -DNDEBUG -O3 -g -fdata-sections -ffunction-sections -D_FILE_OFFSET_BITS=64 -D__STDC_CONSTANT_MACROS -D__STDC_FORMAT_MACROS -pthread -pipe -fno-exceptions -fno-rtti -fdiagnostics-color -Wall -Wextra -Wno-unused-parameter -Wextra-semi -Wundef -std=c++23 -Wno-redundant-move -Wno-restrict -Wno-deprecated-copy -Wno-implicit-fallthrough -Wno-redundant-move -Wno-unused-variable -Wno-format -Wno-strict-aliasing -Wno-cast-function-type -c ../sources/gn-0+git/src/base/sha2.cc -o src/base/sha2.o
[14/216] g++ -MMD -MF src/gn/action_target_generator.o.d -I../sources/gn-0+git/src -I../sources/gn-0+git/src/gn/starlark/vendor/cxx/include -I. -isystemTOPDIR/tmp/work/x86_64-linux/gn-native/0+git/recipe-sysroot-native/usr/include -O2 -pipe -Wno-error=maybe-uninitialized -isystemTOPDIR/tmp/work/x86_64-linux/gn-native/0+git/recipe-sysroot-native/usr/include -O2 -pipe -fvisibility-inlines-hidden -DNDEBUG -O3 -g -fdata-sections -ffunction-sections -D_FILE_OFFSET_BITS=64 -D__STDC_CONSTANT_MACROS -D__STDC_FORMAT_MACROS -pthread -pipe -fno-exceptions -fno-rtti -fdiagnostics-color -Wall -Wextra -Wno-unused-parameter -Wextra-semi -Wundef -std=c++23 -Wno-redundant-move -Wno-restrict -Wno-deprecated-copy -Wno-implicit-fallthrough -Wno-redundant-move -Wno-unused-variable -Wno-format -Wno-strict-aliasing -Wno-cast-function-type -c ../sources/gn-0+git/src/gn/action_target_generator.cc -o src/gn/action_target_generator.o
FAILED: [code=1] src/gn/action_target_generator.o
g++ -MMD -MF src/gn/action_target_generator.o.d -I../sources/gn-0+git/src -I../sources/gn-0+git/src/gn/starlark/vendor/cxx/include -I. -isystemTOPDIR/tmp/work/x86_64-linux/gn-native/0+git/recipe-sysroot-native/usr/include -O2 -pipe -Wno-error=maybe-uninitialized -isystemTOPDIR/tmp/work/x86_64-linux/gn-native/0+git/recipe-sysroot-native/usr/include -O2 -pipe -fvisibility-inlines-hidden -DNDEBUG -O3 -g -fdata-sections -ffunction-sections -D_FILE_OFFSET_BITS=64 -D__STDC_CONSTANT_MACROS -D__STDC_FORMAT_MACROS -pthread -pipe -fno-exceptions -fno-rtti -fdiagnostics-color -Wall -Wextra -Wno-unused-parameter -Wextra-semi -Wundef -std=c++23 -Wno-redundant-move -Wno-restrict -Wno-deprecated-copy -Wno-implicit-fallthrough -Wno-redundant-move -Wno-unused-variable -Wno-format -Wno-strict-aliasing -Wno-cast-function-type -c ../sources/gn-0+git/src/gn/action_target_generator.cc -o src/gn/action_target_generator.o
In file included from ../sources/gn-0+git/src/gn/scope.h:19,
from ../sources/gn-0+git/src/gn/args.h:15,
from ../sources/gn-0+git/src/gn/build_settings.h:15,
from ../sources/gn-0+git/src/gn/metadata.h:10,
from ../sources/gn-0+git/src/gn/target.h:22,
from ../sources/gn-0+git/src/gn/action_target_generator.h:8,
from ../sources/gn-0+git/src/gn/action_target_generator.cc:5:
../sources/gn-0+git/src/gn/err.h:8:10: fatal error: expected: No such file or directory
8 | #include <expected>
| ^~~~~~~~~~
compilation terminated.
[15/216] g++ -MMD -MF src/gn/action_values.o.d -I../sources/gn-0+git/src -I../sources/gn-0+git/src/gn/starlark/vendor/cxx/include -I. -isystemTOPDIR/tmp/work/x86_64-linux/gn-native/0+git/recipe-sysroot-native/usr/include -O2 -pipe -Wno-error=maybe-uninitialized -isystemTOPDIR/tmp/work/x86_64-linux/gn-native/0+git/recipe-sysroot-native/usr/include -O2 -pipe -fvisibility-inlines-hidden -DNDEBUG -O3 -g -fdata-sections -ffunction-sections -D_FILE_OFFSET_BITS=64 -D__STDC_CONSTANT_MACROS -D__STDC_FORMAT_MACROS -pthread -pipe -fno-exceptions -fno-rtti -fdiagnostics-color -Wall -Wextra -Wno-unused-parameter -Wextra-semi -Wundef -std=c++23 -Wno-redundant-move -Wno-restrict -Wno-deprecated-copy -Wno-implicit-fallthrough -Wno-redundant-move -Wno-unused-variable -Wno-format -Wno-strict-aliasing -Wno-cast-function-type -c ../sources/gn-0+git/src/gn/action_values.cc -o src/gn/action_values.o
FAILED: [code=1] src/gn/action_values.o
g++ -MMD -MF src/gn/action_values.o.d -I../sources/gn-0+git/src -I../sources/gn-0+git/src/gn/starlark/vendor/cxx/include -I. -isystemTOPDIR/tmp/work/x86_64-linux/gn-native/0+git/recipe-sysroot-native/usr/include -O2 -pipe -Wno-error=maybe-uninitialized -isystemTOPDIR/tmp/work/x86_64-linux/gn-native/0+git/recipe-sysroot-native/usr/include -O2 -pipe -fvisibility-inlines-hidden -DNDEBUG -O3 -g -fdata-sections -ffunction-sections -D_FILE_OFFSET_BITS=64 -D__STDC_CONSTANT_MACROS -D__STDC_FORMAT_MACROS -pthread -pipe -fno-exceptions -fno-rtti -fdiagnostics-color -Wall -Wextra -Wno-unused-parameter -Wextra-semi -Wundef -std=c++23 -Wno-redundant-move -Wno-restrict -Wno-deprecated-copy -Wno-implicit-fallthrough -Wno-redundant-move -Wno-unused-variable -Wno-format -Wno-strict-aliasing -Wno-cast-function-type -c ../sources/gn-0+git/src/gn/action_values.cc -o src/gn/action_values.o
In file included from ../sources/gn-0+git/src/gn/scope.h:19,
from ../sources/gn-0+git/src/gn/settings.h:11,
from ../sources/gn-0+git/src/gn/action_values.cc:7:
../sources/gn-0+git/src/gn/err.h:8:10: fatal error: expected: No such file or directory
8 | #include <expected>
| ^~~~~~~~~~
compilation terminated.
[16/216] g++ -MMD -MF src/gn/analyzer.o.d -I../sources/gn-0+git/src -I../sources/gn-0+git/src/gn/starlark/vendor/cxx/include -I. -isystemTOPDIR/tmp/work/x86_64-linux/gn-native/0+git/recipe-sysroot-native/usr/include -O2 -pipe -Wno-error=maybe-uninitialized -isystemTOPDIR/tmp/work/x86_64-linux/gn-native/0+git/recipe-sysroot-native/usr/include -O2 -pipe -fvisibility-inlines-hidden -DNDEBUG -O3 -g -fdata-sections -ffunction-sections -D_FILE_OFFSET_BITS=64 -D__STDC_CONSTANT_MACROS -D__STDC_FORMAT_MACROS -pthread -pipe -fno-exceptions -fno-rtti -fdiagnostics-color -Wall -Wextra -Wno-unused-parameter -Wextra-semi -Wundef -std=c++23 -Wno-redundant-move -Wno-restrict -Wno-deprecated-copy -Wno-implicit-fallthrough -Wno-redundant-move -Wno-unused-variable -Wno-format -Wno-strict-aliasing -Wno-cast-function-type -c ../sources/gn-0+git/src/gn/analyzer.cc -o src/gn/analyzer.o
FAILED: [code=1] src/gn/analyzer.o
g++ -MMD -MF src/gn/analyzer.o.d -I../sources/gn-0+git/src -I../sources/gn-0+git/src/gn/starlark/vendor/cxx/include -I. -isystemTOPDIR/tmp/work/x86_64-linux/gn-native/0+git/recipe-sysroot-native/usr/include -O2 -pipe -Wno-error=maybe-uninitialized -isystemTOPDIR/tmp/work/x86_64-linux/gn-native/0+git/recipe-sysroot-native/usr/include -O2 -pipe -fvisibility-inlines-hidden -DNDEBUG -O3 -g -fdata-sections -ffunction-sections -D_FILE_OFFSET_BITS=64 -D__STDC_CONSTANT_MACROS -D__STDC_FORMAT_MACROS -pthread -pipe -fno-exceptions -fno-rtti -fdiagnostics-color -Wall -Wextra -Wno-unused-parameter -Wextra-semi -Wundef -std=c++23 -Wno-redundant-move -Wno-restrict -Wno-deprecated-copy -Wno-implicit-fallthrough -Wno-redundant-move -Wno-unused-variable -Wno-format -Wno-strict-aliasing -Wno-cast-function-type -c ../sources/gn-0+git/src/gn/analyzer.cc -o src/gn/analyzer.o
In file included from ../sources/gn-0+git/src/gn/scope.h:19,
from ../sources/gn-0+git/src/gn/args.h:15,
from ../sources/gn-0+git/src/gn/build_settings.h:15,
from ../sources/gn-0+git/src/gn/metadata.h:10,
from ../sources/gn-0+git/src/gn/target.h:22,
from ../sources/gn-0+git/src/gn/analyzer.h:16,
from ../sources/gn-0+git/src/gn/analyzer.cc:5:
../sources/gn-0+git/src/gn/err.h:8:10: fatal error: expected: No such file or directory
8 | #include <expected>
| ^~~~~~~~~~
compilation terminated.
[17/216] g++ -MMD -MF src/gn/args.o.d -I../sources/gn-0+git/src -I../sources/gn-0+git/src/gn/starlark/vendor/cxx/include -I. -isystemTOPDIR/tmp/work/x86_64-linux/gn-native/0+git/recipe-sysroot-native/usr/include -O2 -pipe -Wno-error=maybe-uninitialized -isystemTOPDIR/tmp/work/x86_64-linux/gn-native/0+git/recipe-sysroot-native/usr/include -O2 -pipe -fvisibility-inlines-hidden -DNDEBUG -O3 -g -fdata-sections -ffunction-sections -D_FILE_OFFSET_BITS=64 -D__STDC_CONSTANT_MACROS -D__STDC_FORMAT_MACROS -pthread -pipe -fno-exceptions -fno-rtti -fdiagnostics-color -Wall -Wextra -Wno-unused-parameter -Wextra-semi -Wundef -std=c++23 -Wno-redundant-move -Wno-restrict -Wno-deprecated-copy -Wno-implicit-fallthrough -Wno-redundant-move -Wno-unused-variable -Wno-format -Wno-strict-aliasing -Wno-cast-function-type -c ../sources/gn-0+git/src/gn/args.cc -o src/gn/args.o
FAILED: [code=1] src/gn/args.o
g++ -MMD -MF src/gn/args.o.d -I../sources/gn-0+git/src -I../sources/gn-0+git/src/gn/starlark/vendor/cxx/include -I. -isystemTOPDIR/tmp/work/x86_64-linux/gn-native/0+git/recipe-sysroot-native/usr/include -O2 -pipe -Wno-error=maybe-uninitialized -isystemTOPDIR/tmp/work/x86_64-linux/gn-native/0+git/recipe-sysroot-native/usr/include -O2 -pipe -fvisibility-inlines-hidden -DNDEBUG -O3 -g -fdata-sections -ffunction-sections -D_FILE_OFFSET_BITS=64 -D__STDC_CONSTANT_MACROS -D__STDC_FORMAT_MACROS -pthread -pipe -fno-exceptions -fno-rtti -fdiagnostics-color -Wall -Wextra -Wno-unused-parameter -Wextra-semi -Wundef -std=c++23 -Wno-redundant-move -Wno-restrict -Wno-deprecated-copy -Wno-implicit-fallthrough -Wno-redundant-move -Wno-unused-variable -Wno-format -Wno-strict-aliasing -Wno-cast-function-type -c ../sources/gn-0+git/src/gn/args.cc -o src/gn/args.o
In file included from ../sources/gn-0+git/src/gn/scope.h:19,
from ../sources/gn-0+git/src/gn/args.h:15,
from ../sources/gn-0+git/src/gn/args.cc:5:
../sources/gn-0+git/src/gn/err.h:8:10: fatal error: expected: No such file or directory
8 | #include <expected>
| ^~~~~~~~~~
compilation terminated.
[18/216] g++ -MMD -MF src/gn/binary_target_generator.o.d -I../sources/gn-0+git/src -I../sources/gn-0+git/src/gn/starlark/vendor/cxx/include -I. -isystemTOPDIR/tmp/work/x86_64-linux/gn-native/0+git/recipe-sysroot-native/usr/include -O2 -pipe -Wno-error=maybe-uninitialized -isystemTOPDIR/tmp/work/x86_64-linux/gn-native/0+git/recipe-sysroot-native/usr/include -O2 -pipe -fvisibility-inlines-hidden -DNDEBUG -O3 -g -fdata-sections -ffunction-sections -D_FILE_OFFSET_BITS=64 -D__STDC_CONSTANT_MACROS -D__STDC_FORMAT_MACROS -pthread -pipe -fno-exceptions -fno-rtti -fdiagnostics-color -Wall -Wextra -Wno-unused-parameter -Wextra-semi -Wundef -std=c++23 -Wno-redundant-move -Wno-restrict -Wno-deprecated-copy -Wno-implicit-fallthrough -Wno-redundant-move -Wno-unused-variable -Wno-format -Wno-strict-aliasing -Wno-cast-function-type -c ../sources/gn-0+git/src/gn/binary_target_generator.cc -o src/gn/binary_target_generator.o
FAILED: [code=1] src/gn/binary_target_generator.o
g++ -MMD -MF src/gn/binary_target_generator.o.d -I../sources/gn-0+git/src -I../sources/gn-0+git/src/gn/starlark/vendor/cxx/include -I. -isystemTOPDIR/tmp/work/x86_64-linux/gn-native/0+git/recipe-sysroot-native/usr/include -O2 -pipe -Wno-error=maybe-uninitialized -isystemTOPDIR/tmp/work/x86_64-linux/gn-native/0+git/recipe-sysroot-native/usr/include -O2 -pipe -fvisibility-inlines-hidden -DNDEBUG -O3 -g -fdata-sections -ffunction-sections -D_FILE_OFFSET_BITS=64 -D__STDC_CONSTANT_MACROS -D__STDC_FORMAT_MACROS -pthread -pipe -fno-exceptions -fno-rtti -fdiagnostics-color -Wall -Wextra -Wno-unused-parameter -Wextra-semi -Wundef -std=c++23 -Wno-redundant-move -Wno-restrict -Wno-deprecated-copy -Wno-implicit-fallthrough -Wno-redundant-move -Wno-unused-variable -Wno-format -Wno-strict-aliasing -Wno-cast-function-type -c ../sources/gn-0+git/src/gn/binary_target_generator.cc -o src/gn/binary_target_generator.o
In file included from ../sources/gn-0+git/src/gn/scope.h:19,
from ../sources/gn-0+git/src/gn/args.h:15,
from ../sources/gn-0+git/src/gn/build_settings.h:15,
from ../sources/gn-0+git/src/gn/metadata.h:10,
from ../sources/gn-0+git/src/gn/target.h:22,
from ../sources/gn-0+git/src/gn/binary_target_generator.h:8,
from ../sources/gn-0+git/src/gn/binary_target_generator.cc:5:
../sources/gn-0+git/src/gn/err.h:8:10: fatal error: expected: No such file or directory
8 | #include <expected>
| ^~~~~~~~~~
compilation terminated.
[19/216] g++ -MMD -MF src/gn/build_file_editor.o.d -I../sources/gn-0+git/src -I../sources/gn-0+git/src/gn/starlark/vendor/cxx/include -I. -isystemTOPDIR/tmp/work/x86_64-linux/gn-native/0+git/recipe-sysroot-native/usr/include -O2 -pipe -Wno-error=maybe-uninitialized -isystemTOPDIR/tmp/work/x86_64-linux/gn-native/0+git/recipe-sysroot-native/usr/include -O2 -pipe -fvisibility-inlines-hidden -DNDEBUG -O3 -g -fdata-sections -ffunction-sections -D_FILE_OFFSET_BITS=64 -D__STDC_CONSTANT_MACROS -D__STDC_FORMAT_MACROS -pthread -pipe -fno-exceptions -fno-rtti -fdiagnostics-color -Wall -Wextra -Wno-unused-parameter -Wextra-semi -Wundef -std=c++23 -Wno-redundant-move -Wno-restrict -Wno-deprecated-copy -Wno-implicit-fallthrough -Wno-redundant-move -Wno-unused-variable -Wno-format -Wno-strict-aliasing -Wno-cast-function-type -c ../sources/gn-0+git/src/gn/build_file_editor.cc -o src/gn/build_file_editor.o
FAILED: [code=1] src/gn/build_file_editor.o
g++ -MMD -MF src/gn/build_file_editor.o.d -I../sources/gn-0+git/src -I../sources/gn-0+git/src/gn/starlark/vendor/cxx/include -I. -isystemTOPDIR/tmp/work/x86_64-linux/gn-native/0+git/recipe-sysroot-native/usr/include -O2 -pipe -Wno-error=maybe-uninitialized -isystemTOPDIR/tmp/work/x86_64-linux/gn-native/0+git/recipe-sysroot-native/usr/include -O2 -pipe -fvisibility-inlines-hidden -DNDEBUG -O3 -g -fdata-sections -ffunction-sections -D_FILE_OFFSET_BITS=64 -D__STDC_CONSTANT_MACROS -D__STDC_FORMAT_MACROS -pthread -pipe -fno-exceptions -fno-rtti -fdiagnostics-color -Wall -Wextra -Wno-unused-parameter -Wextra-semi -Wundef -std=c++23 -Wno-redundant-move -Wno-restrict -Wno-deprecated-copy -Wno-implicit-fallthrough -Wno-redundant-move -Wno-unused-variable -Wno-format -Wno-strict-aliasing -Wno-cast-function-type -c ../sources/gn-0+git/src/gn/build_file_editor.cc -o src/gn/build_file_editor.o
In file included from ../sources/gn-0+git/src/gn/build_file_editor.h:16,
from ../sources/gn-0+git/src/gn/build_file_editor.cc:5:
../sources/gn-0+git/src/gn/err.h:8:10: fatal error: expected: No such file or directory
8 | #include <expected>
| ^~~~~~~~~~
compilation terminated.
[20/216] g++ -MMD -MF src/gn/build_settings.o.d -I../sources/gn-0+git/src -I../sources/gn-0+git/src/gn/starlark/vendor/cxx/include -I. -isystemTOPDIR/tmp/work/x86_64-linux/gn-native/0+git/recipe-sysroot-native/usr/include -O2 -pipe -Wno-error=maybe-uninitialized -isystemTOPDIR/tmp/work/x86_64-linux/gn-native/0+git/recipe-sysroot-native/usr/include -O2 -pipe -fvisibility-inlines-hidden -DNDEBUG -O3 -g -fdata-sections -ffunction-sections -D_FILE_OFFSET_BITS=64 -D__STDC_CONSTANT_MACROS -D__STDC_FORMAT_MACROS -pthread -pipe -fno-exceptions -fno-rtti -fdiagnostics-color -Wall -Wextra -Wno-unused-parameter -Wextra-semi -Wundef -std=c++23 -Wno-redundant-move -Wno-restrict -Wno-deprecated-copy -Wno-implicit-fallthrough -Wno-redundant-move -Wno-unused-variable -Wno-format -Wno-strict-aliasing -Wno-cast-function-type -c ../sources/gn-0+git/src/gn/build_settings.cc -o src/gn/build_settings.o
FAILED: [code=1] src/gn/build_settings.o
g++ -MMD -MF src/gn/build_settings.o.d -I../sources/gn-0+git/src -I../sources/gn-0+git/src/gn/starlark/vendor/cxx/include -I. -isystemTOPDIR/tmp/work/x86_64-linux/gn-native/0+git/recipe-sysroot-native/usr/include -O2 -pipe -Wno-error=maybe-uninitialized -isystemTOPDIR/tmp/work/x86_64-linux/gn-native/0+git/recipe-sysroot-native/usr/include -O2 -pipe -fvisibility-inlines-hidden -DNDEBUG -O3 -g -fdata-sections -ffunction-sections -D_FILE_OFFSET_BITS=64 -D__STDC_CONSTANT_MACROS -D__STDC_FORMAT_MACROS -pthread -pipe -fno-exceptions -fno-rtti -fdiagnostics-color -Wall -Wextra -Wno-unused-parameter -Wextra-semi -Wundef -std=c++23 -Wno-redundant-move -Wno-restrict -Wno-deprecated-copy -Wno-implicit-fallthrough -Wno-redundant-move -Wno-unused-variable -Wno-format -Wno-strict-aliasing -Wno-cast-function-type -c ../sources/gn-0+git/src/gn/build_settings.cc -o src/gn/build_settings.o
In file included from ../sources/gn-0+git/src/gn/scope.h:19,
from ../sources/gn-0+git/src/gn/args.h:15,
from ../sources/gn-0+git/src/gn/build_settings.h:15,
from ../sources/gn-0+git/src/gn/build_settings.cc:5:
../sources/gn-0+git/src/gn/err.h:8:10: fatal error: expected: No such file or directory
8 | #include <expected>
| ^~~~~~~~~~
compilation terminated.
[21/216] g++ -MMD -MF src/gn/builder.o.d -I../sources/gn-0+git/src -I../sources/gn-0+git/src/gn/starlark/vendor/cxx/include -I. -isystemTOPDIR/tmp/work/x86_64-linux/gn-native/0+git/recipe-sysroot-native/usr/include -O2 -pipe -Wno-error=maybe-uninitialized -isystemTOPDIR/tmp/work/x86_64-linux/gn-native/0+git/recipe-sysroot-native/usr/include -O2 -pipe -fvisibility-inlines-hidden -DNDEBUG -O3 -g -fdata-sections -ffunction-sections -D_FILE_OFFSET_BITS=64 -D__STDC_CONSTANT_MACROS -D__STDC_FORMAT_MACROS -pthread -pipe -fno-exceptions -fno-rtti -fdiagnostics-color -Wall -Wextra -Wno-unused-parameter -Wextra-semi -Wundef -std=c++23 -Wno-redundant-move -Wno-restrict -Wno-deprecated-copy -Wno-implicit-fallthrough -Wno-redundant-move -Wno-unused-variable -Wno-format -Wno-strict-aliasing -Wno-cast-function-type -c ../sources/gn-0+git/src/gn/builder.cc -o src/gn/builder.o
FAILED: [code=1] src/gn/builder.o
g++ -MMD -MF src/gn/builder.o.d -I../sources/gn-0+git/src -I../sources/gn-0+git/src/gn/starlark/vendor/cxx/include -I. -isystemTOPDIR/tmp/work/x86_64-linux/gn-native/0+git/recipe-sysroot-native/usr/include -O2 -pipe -Wno-error=maybe-uninitialized -isystemTOPDIR/tmp/work/x86_64-linux/gn-native/0+git/recipe-sysroot-native/usr/include -O2 -pipe -fvisibility-inlines-hidden -DNDEBUG -O3 -g -fdata-sections -ffunction-sections -D_FILE_OFFSET_BITS=64 -D__STDC_CONSTANT_MACROS -D__STDC_FORMAT_MACROS -pthread -pipe -fno-exceptions -fno-rtti -fdiagnostics-color -Wall -Wextra -Wno-unused-parameter -Wextra-semi -Wundef -std=c++23 -Wno-redundant-move -Wno-restrict -Wno-deprecated-copy -Wno-implicit-fallthrough -Wno-redundant-move -Wno-unused-variable -Wno-format -Wno-strict-aliasing -Wno-cast-function-type -c ../sources/gn-0+git/src/gn/builder.cc -o src/gn/builder.o
In file included from ../sources/gn-0+git/src/gn/builder.cc:14:
../sources/gn-0+git/src/gn/err.h:8:10: fatal error: expected: No such file or directory
8 | #include <expected>
| ^~~~~~~~~~
compilation terminated.
[22/216] g++ -MMD -MF src/gn/bundle_data.o.d -I../sources/gn-0+git/src -I../sources/gn-0+git/src/gn/starlark/vendor/cxx/include -I. -isystemTOPDIR/tmp/work/x86_64-linux/gn-native/0+git/recipe-sysroot-native/usr/include -O2 -pipe -Wno-error=maybe-uninitialized -isystemTOPDIR/tmp/work/x86_64-linux/gn-native/0+git/recipe-sysroot-native/usr/include -O2 -pipe -fvisibility-inlines-hidden -DNDEBUG -O3 -g -fdata-sections -ffunction-sections -D_FILE_OFFSET_BITS=64 -D__STDC_CONSTANT_MACROS -D__STDC_FORMAT_MACROS -pthread -pipe -fno-exceptions -fno-rtti -fdiagnostics-color -Wall -Wextra -Wno-unused-parameter -Wextra-semi -Wundef -std=c++23 -Wno-redundant-move -Wno-restrict -Wno-deprecated-copy -Wno-implicit-fallthrough -Wno-redundant-move -Wno-unused-variable -Wno-format -Wno-strict-aliasing -Wno-cast-function-type -c ../sources/gn-0+git/src/gn/bundle_data.cc -o src/gn/bundle_data.o
FAILED: [code=1] src/gn/bundle_data.o
g++ -MMD -MF src/gn/bundle_data.o.d -I../sources/gn-0+git/src -I../sources/gn-0+git/src/gn/starlark/vendor/cxx/include -I. -isystemTOPDIR/tmp/work/x86_64-linux/gn-native/0+git/recipe-sysroot-native/usr/include -O2 -pipe -Wno-error=maybe-uninitialized -isystemTOPDIR/tmp/work/x86_64-linux/gn-native/0+git/recipe-sysroot-native/usr/include -O2 -pipe -fvisibility-inlines-hidden -DNDEBUG -O3 -g -fdata-sections -ffunction-sections -D_FILE_OFFSET_BITS=64 -D__STDC_CONSTANT_MACROS -D__STDC_FORMAT_MACROS -pthread -pipe -fno-exceptions -fno-rtti -fdiagnostics-color -Wall -Wextra -Wno-unused-parameter -Wextra-semi -Wundef -std=c++23 -Wno-redundant-move -Wno-restrict -Wno-deprecated-copy -Wno-implicit-fallthrough -Wno-redundant-move -Wno-unused-variable -Wno-format -Wno-strict-aliasing -Wno-cast-function-type -c ../sources/gn-0+git/src/gn/bundle_data.cc -o src/gn/bundle_data.o
In file included from ../sources/gn-0+git/src/gn/scope.h:19,
from ../sources/gn-0+git/src/gn/settings.h:11,
from ../sources/gn-0+git/src/gn/filesystem_utils.h:14,
from ../sources/gn-0+git/src/gn/bundle_data.cc:9:
../sources/gn-0+git/src/gn/err.h:8:10: fatal error: expected: No such file or directory
8 | #include <expected>
| ^~~~~~~~~~
compilation terminated.
[23/216] g++ -MMD -MF src/gn/bundle_data_target_generator.o.d -I../sources/gn-0+git/src -I../sources/gn-0+git/src/gn/starlark/vendor/cxx/include -I. -isystemTOPDIR/tmp/work/x86_64-linux/gn-native/0+git/recipe-sysroot-native/usr/include -O2 -pipe -Wno-error=maybe-uninitialized -isystemTOPDIR/tmp/work/x86_64-linux/gn-native/0+git/recipe-sysroot-native/usr/include -O2 -pipe -fvisibility-inlines-hidden -DNDEBUG -O3 -g -fdata-sections -ffunction-sections -D_FILE_OFFSET_BITS=64 -D__STDC_CONSTANT_MACROS -D__STDC_FORMAT_MACROS -pthread -pipe -fno-exceptions -fno-rtti -fdiagnostics-color -Wall -Wextra -Wno-unused-parameter -Wextra-semi -Wundef -std=c++23 -Wno-redundant-move -Wno-restrict -Wno-deprecated-copy -Wno-implicit-fallthrough -Wno-redundant-move -Wno-unused-variable -Wno-format -Wno-strict-aliasing -Wno-cast-function-type -c ../sources/gn-0+git/src/gn/bundle_data_target_generator.cc -o src/gn/bundle_data_target_generator.o
FAILED: [code=1] src/gn/bundle_data_target_generator.o
g++ -MMD -MF src/gn/bundle_data_target_generator.o.d -I../sources/gn-0+git/src -I../sources/gn-0+git/src/gn/starlark/vendor/cxx/include -I. -isystemTOPDIR/tmp/work/x86_64-linux/gn-native/0+git/recipe-sysroot-native/usr/include -O2 -pipe -Wno-error=maybe-uninitialized -isystemTOPDIR/tmp/work/x86_64-linux/gn-native/0+git/recipe-sysroot-native/usr/include -O2 -pipe -fvisibility-inlines-hidden -DNDEBUG -O3 -g -fdata-sections -ffunction-sections -D_FILE_OFFSET_BITS=64 -D__STDC_CONSTANT_MACROS -D__STDC_FORMAT_MACROS -pthread -pipe -fno-exceptions -fno-rtti -fdiagnostics-color -Wall -Wextra -Wno-unused-parameter -Wextra-semi -Wundef -std=c++23 -Wno-redundant-move -Wno-restrict -Wno-deprecated-copy -Wno-implicit-fallthrough -Wno-redundant-move -Wno-unused-variable -Wno-format -Wno-strict-aliasing -Wno-cast-function-type -c ../sources/gn-0+git/src/gn/bundle_data_target_generator.cc -o src/gn/bundle_data_target_generator.o
In file included from ../sources/gn-0+git/src/gn/parse_tree.h:17,
from ../sources/gn-0+git/src/gn/bundle_data_target_generator.cc:7:
../sources/gn-0+git/src/gn/err.h:8:10: fatal error: expected: No such file or directory
8 | #include <expected>
| ^~~~~~~~~~
compilation terminated.
[24/216] g++ -MMD -MF src/gn/bundle_file_rule.o.d -I../sources/gn-0+git/src -I../sources/gn-0+git/src/gn/starlark/vendor/cxx/include -I. -isystemTOPDIR/tmp/work/x86_64-linux/gn-native/0+git/recipe-sysroot-native/usr/include -O2 -pipe -Wno-error=maybe-uninitialized -isystemTOPDIR/tmp/work/x86_64-linux/gn-native/0+git/recipe-sysroot-native/usr/include -O2 -pipe -fvisibility-inlines-hidden -DNDEBUG -O3 -g -fdata-sections -ffunction-sections -D_FILE_OFFSET_BITS=64 -D__STDC_CONSTANT_MACROS -D__STDC_FORMAT_MACROS -pthread -pipe -fno-exceptions -fno-rtti -fdiagnostics-color -Wall -Wextra -Wno-unused-parameter -Wextra-semi -Wundef -std=c++23 -Wno-redundant-move -Wno-restrict -Wno-deprecated-copy -Wno-implicit-fallthrough -Wno-redundant-move -Wno-unused-variable -Wno-format -Wno-strict-aliasing -Wno-cast-function-type -c ../sources/gn-0+git/src/gn/bundle_file_rule.cc -o src/gn/bundle_file_rule.o
FAILED: [code=1] src/gn/bundle_file_rule.o
g++ -MMD -MF src/gn/bundle_file_rule.o.d -I../sources/gn-0+git/src -I../sources/gn-0+git/src/gn/starlark/vendor/cxx/include -I. -isystemTOPDIR/tmp/work/x86_64-linux/gn-native/0+git/recipe-sysroot-native/usr/include -O2 -pipe -Wno-error=maybe-uninitialized -isystemTOPDIR/tmp/work/x86_64-linux/gn-native/0+git/recipe-sysroot-native/usr/include -O2 -pipe -fvisibility-inlines-hidden -DNDEBUG -O3 -g -fdata-sections -ffunction-sections -D_FILE_OFFSET_BITS=64 -D__STDC_CONSTANT_MACROS -D__STDC_FORMAT_MACROS -pthread -pipe -fno-exceptions -fno-rtti -fdiagnostics-color -Wall -Wextra -Wno-unused-parameter -Wextra-semi -Wundef -std=c++23 -Wno-redundant-move -Wno-restrict -Wno-deprecated-copy -Wno-implicit-fallthrough -Wno-redundant-move -Wno-unused-variable -Wno-format -Wno-strict-aliasing -Wno-cast-function-type -c ../sources/gn-0+git/src/gn/bundle_file_rule.cc -o src/gn/bundle_file_rule.o
In file included from ../sources/gn-0+git/src/gn/scope.h:19,
from ../sources/gn-0+git/src/gn/settings.h:11,
from ../sources/gn-0+git/src/gn/bundle_file_rule.cc:9:
../sources/gn-0+git/src/gn/err.h:8:10: fatal error: expected: No such file or directory
8 | #include <expected>
| ^~~~~~~~~~
compilation terminated.
[25/216] g++ -MMD -MF src/gn/builtin_tool.o.d -I../sources/gn-0+git/src -I../sources/gn-0+git/src/gn/starlark/vendor/cxx/include -I. -isystemTOPDIR/tmp/work/x86_64-linux/gn-native/0+git/recipe-sysroot-native/usr/include -O2 -pipe -Wno-error=maybe-uninitialized -isystemTOPDIR/tmp/work/x86_64-linux/gn-native/0+git/recipe-sysroot-native/usr/include -O2 -pipe -fvisibility-inlines-hidden -DNDEBUG -O3 -g -fdata-sections -ffunction-sections -D_FILE_OFFSET_BITS=64 -D__STDC_CONSTANT_MACROS -D__STDC_FORMAT_MACROS -pthread -pipe -fno-exceptions -fno-rtti -fdiagnostics-color -Wall -Wextra -Wno-unused-parameter -Wextra-semi -Wundef -std=c++23 -Wno-redundant-move -Wno-restrict -Wno-deprecated-copy -Wno-implicit-fallthrough -Wno-redundant-move -Wno-unused-variable -Wno-format -Wno-strict-aliasing -Wno-cast-function-type -c ../sources/gn-0+git/src/gn/builtin_tool.cc -o src/gn/builtin_tool.o
FAILED: [code=1] src/gn/builtin_tool.o
g++ -MMD -MF src/gn/builtin_tool.o.d -I../sources/gn-0+git/src -I../sources/gn-0+git/src/gn/starlark/vendor/cxx/include -I. -isystemTOPDIR/tmp/work/x86_64-linux/gn-native/0+git/recipe-sysroot-native/usr/include -O2 -pipe -Wno-error=maybe-uninitialized -isystemTOPDIR/tmp/work/x86_64-linux/gn-native/0+git/recipe-sysroot-native/usr/include -O2 -pipe -fvisibility-inlines-hidden -DNDEBUG -O3 -g -fdata-sections -ffunction-sections -D_FILE_OFFSET_BITS=64 -D__STDC_CONSTANT_MACROS -D__STDC_FORMAT_MACROS -pthread -pipe -fno-exceptions -fno-rtti -fdiagnostics-color -Wall -Wextra -Wno-unused-parameter -Wextra-semi -Wundef -std=c++23 -Wno-redundant-move -Wno-restrict -Wno-deprecated-copy -Wno-implicit-fallthrough -Wno-redundant-move -Wno-unused-variable -Wno-format -Wno-strict-aliasing -Wno-cast-function-type -c ../sources/gn-0+git/src/gn/builtin_tool.cc -o src/gn/builtin_tool.o
In file included from ../sources/gn-0+git/src/gn/scope.h:19,
from ../sources/gn-0+git/src/gn/tool.h:16,
from ../sources/gn-0+git/src/gn/builtin_tool.h:12,
from ../sources/gn-0+git/src/gn/builtin_tool.cc:5:
../sources/gn-0+git/src/gn/err.h:8:10: fatal error: expected: No such file or directory
8 | #include <expected>
| ^~~~~~~~~~
compilation terminated.
[26/216] g++ -MMD -MF src/gn/c_substitution_type.o.d -I../sources/gn-0+git/src -I../sources/gn-0+git/src/gn/starlark/vendor/cxx/include -I. -isystemTOPDIR/tmp/work/x86_64-linux/gn-native/0+git/recipe-sysroot-native/usr/include -O2 -pipe -Wno-error=maybe-uninitialized -isystemTOPDIR/tmp/work/x86_64-linux/gn-native/0+git/recipe-sysroot-native/usr/include -O2 -pipe -fvisibility-inlines-hidden -DNDEBUG -O3 -g -fdata-sections -ffunction-sections -D_FILE_OFFSET_BITS=64 -D__STDC_CONSTANT_MACROS -D__STDC_FORMAT_MACROS -pthread -pipe -fno-exceptions -fno-rtti -fdiagnostics-color -Wall -Wextra -Wno-unused-parameter -Wextra-semi -Wundef -std=c++23 -Wno-redundant-move -Wno-restrict -Wno-deprecated-copy -Wno-implicit-fallthrough -Wno-redundant-move -Wno-unused-variable -Wno-format -Wno-strict-aliasing -Wno-cast-function-type -c ../sources/gn-0+git/src/gn/c_substitution_type.cc -o src/gn/c_substitution_type.o
FAILED: [code=1] src/gn/c_substitution_type.o
g++ -MMD -MF src/gn/c_substitution_type.o.d -I../sources/gn-0+git/src -I../sources/gn-0+git/src/gn/starlark/vendor/cxx/include -I. -isystemTOPDIR/tmp/work/x86_64-linux/gn-native/0+git/recipe-sysroot-native/usr/include -O2 -pipe -Wno-error=maybe-uninitialized -isystemTOPDIR/tmp/work/x86_64-linux/gn-native/0+git/recipe-sysroot-native/usr/include -O2 -pipe -fvisibility-inlines-hidden -DNDEBUG -O3 -g -fdata-sections -ffunction-sections -D_FILE_OFFSET_BITS=64 -D__STDC_CONSTANT_MACROS -D__STDC_FORMAT_MACROS -pthread -pipe -fno-exceptions -fno-rtti -fdiagnostics-color -Wall -Wextra -Wno-unused-parameter -Wextra-semi -Wundef -std=c++23 -Wno-redundant-move -Wno-restrict -Wno-deprecated-copy -Wno-implicit-fallthrough -Wno-redundant-move -Wno-unused-variable -Wno-format -Wno-strict-aliasing -Wno-cast-function-type -c ../sources/gn-0+git/src/gn/c_substitution_type.cc -o src/gn/c_substitution_type.o
In file included from ../sources/gn-0+git/src/gn/c_substitution_type.cc:10:
../sources/gn-0+git/src/gn/err.h:8:10: fatal error: expected: No such file or directory
8 | #include <expected>
| ^~~~~~~~~~
compilation terminated.
[27/216] g++ -MMD -MF src/gn/c_tool.o.d -I../sources/gn-0+git/src -I../sources/gn-0+git/src/gn/starlark/vendor/cxx/include -I. -isystemTOPDIR/tmp/work/x86_64-linux/gn-native/0+git/recipe-sysroot-native/usr/include -O2 -pipe -Wno-error=maybe-uninitialized -isystemTOPDIR/tmp/work/x86_64-linux/gn-native/0+git/recipe-sysroot-native/usr/include -O2 -pipe -fvisibility-inlines-hidden -DNDEBUG -O3 -g -fdata-sections -ffunction-sections -D_FILE_OFFSET_BITS=64 -D__STDC_CONSTANT_MACROS -D__STDC_FORMAT_MACROS -pthread -pipe -fno-exceptions -fno-rtti -fdiagnostics-color -Wall -Wextra -Wno-unused-parameter -Wextra-semi -Wundef -std=c++23 -Wno-redundant-move -Wno-restrict -Wno-deprecated-copy -Wno-implicit-fallthrough -Wno-redundant-move -Wno-unused-variable -Wno-format -Wno-strict-aliasing -Wno-cast-function-type -c ../sources/gn-0+git/src/gn/c_tool.cc -o src/gn/c_tool.o
FAILED: [code=1] src/gn/c_tool.o
g++ -MMD -MF src/gn/c_tool.o.d -I../sources/gn-0+git/src -I../sources/gn-0+git/src/gn/starlark/vendor/cxx/include -I. -isystemTOPDIR/tmp/work/x86_64-linux/gn-native/0+git/recipe-sysroot-native/usr/include -O2 -pipe -Wno-error=maybe-uninitialized -isystemTOPDIR/tmp/work/x86_64-linux/gn-native/0+git/recipe-sysroot-native/usr/include -O2 -pipe -fvisibility-inlines-hidden -DNDEBUG -O3 -g -fdata-sections -ffunction-sections -D_FILE_OFFSET_BITS=64 -D__STDC_CONSTANT_MACROS -D__STDC_FORMAT_MACROS -pthread -pipe -fno-exceptions -fno-rtti -fdiagnostics-color -Wall -Wextra -Wno-unused-parameter -Wextra-semi -Wundef -std=c++23 -Wno-redundant-move -Wno-restrict -Wno-deprecated-copy -Wno-implicit-fallthrough -Wno-redundant-move -Wno-unused-variable -Wno-format -Wno-strict-aliasing -Wno-cast-function-type -c ../sources/gn-0+git/src/gn/c_tool.cc -o src/gn/c_tool.o
In file included from ../sources/gn-0+git/src/gn/scope.h:19,
from ../sources/gn-0+git/src/gn/c_tool.h:13,
from ../sources/gn-0+git/src/gn/c_tool.cc:5:
../sources/gn-0+git/src/gn/err.h:8:10: fatal error: expected: No such file or directory
8 | #include <expected>
| ^~~~~~~~~~
compilation terminated.
[28/216] g++ -MMD -MF src/gn/command_analyze.o.d -I../sources/gn-0+git/src -I../sources/gn-0+git/src/gn/starlark/vendor/cxx/include -I. -isystemTOPDIR/tmp/work/x86_64-linux/gn-native/0+git/recipe-sysroot-native/usr/include -O2 -pipe -Wno-error=maybe-uninitialized -isystemTOPDIR/tmp/work/x86_64-linux/gn-native/0+git/recipe-sysroot-native/usr/include -O2 -pipe -fvisibility-inlines-hidden -DNDEBUG -O3 -g -fdata-sections -ffunction-sections -D_FILE_OFFSET_BITS=64 -D__STDC_CONSTANT_MACROS -D__STDC_FORMAT_MACROS -pthread -pipe -fno-exceptions -fno-rtti -fdiagnostics-color -Wall -Wextra -Wno-unused-parameter -Wextra-semi -Wundef -std=c++23 -Wno-redundant-move -Wno-restrict -Wno-deprecated-copy -Wno-implicit-fallthrough -Wno-redundant-move -Wno-unused-variable -Wno-format -Wno-strict-aliasing -Wno-cast-function-type -c ../sources/gn-0+git/src/gn/command_analyze.cc -o src/gn/command_analyze.o
FAILED: [code=1] src/gn/command_analyze.o
g++ -MMD -MF src/gn/command_analyze.o.d -I../sources/gn-0+git/src -I../sources/gn-0+git/src/gn/starlark/vendor/cxx/include -I. -isystemTOPDIR/tmp/work/x86_64-linux/gn-native/0+git/recipe-sysroot-native/usr/include -O2 -pipe -Wno-error=maybe-uninitialized -isystemTOPDIR/tmp/work/x86_64-linux/gn-native/0+git/recipe-sysroot-native/usr/include -O2 -pipe -fvisibility-inlines-hidden -DNDEBUG -O3 -g -fdata-sections -ffunction-sections -D_FILE_OFFSET_BITS=64 -D__STDC_CONSTANT_MACROS -D__STDC_FORMAT_MACROS -pthread -pipe -fno-exceptions -fno-rtti -fdiagnostics-color -Wall -Wextra -Wno-unused-parameter -Wextra-semi -Wundef -std=c++23 -Wno-redundant-move -Wno-restrict -Wno-deprecated-copy -Wno-implicit-fallthrough -Wno-redundant-move -Wno-unused-variable -Wno-format -Wno-strict-aliasing -Wno-cast-function-type -c ../sources/gn-0+git/src/gn/command_analyze.cc -o src/gn/command_analyze.o
In file included from ../sources/gn-0+git/src/gn/scope.h:19,
from ../sources/gn-0+git/src/gn/args.h:15,
from ../sources/gn-0+git/src/gn/build_settings.h:15,
from ../sources/gn-0+git/src/gn/metadata.h:10,
from ../sources/gn-0+git/src/gn/target.h:22,
from ../sources/gn-0+git/src/gn/analyzer.h:16,
from ../sources/gn-0+git/src/gn/command_analyze.cc:12:
../sources/gn-0+git/src/gn/err.h:8:10: fatal error: expected: No such file or directory
8 | #include <expected>
| ^~~~~~~~~~
compilation terminated.
[29/216] g++ -MMD -MF src/gn/command_args.o.d -I../sources/gn-0+git/src -I../sources/gn-0+git/src/gn/starlark/vendor/cxx/include -I. -isystemTOPDIR/tmp/work/x86_64-linux/gn-native/0+git/recipe-sysroot-native/usr/include -O2 -pipe -Wno-error=maybe-uninitialized -isystemTOPDIR/tmp/work/x86_64-linux/gn-native/0+git/recipe-sysroot-native/usr/include -O2 -pipe -fvisibility-inlines-hidden -DNDEBUG -O3 -g -fdata-sections -ffunction-sections -D_FILE_OFFSET_BITS=64 -D__STDC_CONSTANT_MACROS -D__STDC_FORMAT_MACROS -pthread -pipe -fno-exceptions -fno-rtti -fdiagnostics-color -Wall -Wextra -Wno-unused-parameter -Wextra-semi -Wundef -std=c++23 -Wno-redundant-move -Wno-restrict -Wno-deprecated-copy -Wno-implicit-fallthrough -Wno-redundant-move -Wno-unused-variable -Wno-format -Wno-strict-aliasing -Wno-cast-function-type -c ../sources/gn-0+git/src/gn/command_args.cc -o src/gn/command_args.o
FAILED: [code=1] src/gn/command_args.o
g++ -MMD -MF src/gn/command_args.o.d -I../sources/gn-0+git/src -I../sources/gn-0+git/src/gn/starlark/vendor/cxx/include -I. -isystemTOPDIR/tmp/work/x86_64-linux/gn-native/0+git/recipe-sysroot-native/usr/include -O2 -pipe -Wno-error=maybe-uninitialized -isystemTOPDIR/tmp/work/x86_64-linux/gn-native/0+git/recipe-sysroot-native/usr/include -O2 -pipe -fvisibility-inlines-hidden -DNDEBUG -O3 -g -fdata-sections -ffunction-sections -D_FILE_OFFSET_BITS=64 -D__STDC_CONSTANT_MACROS -D__STDC_FORMAT_MACROS -pthread -pipe -fno-exceptions -fno-rtti -fdiagnostics-color -Wall -Wextra -Wno-unused-parameter -Wextra-semi -Wundef -std=c++23 -Wno-redundant-move -Wno-restrict -Wno-deprecated-copy -Wno-implicit-fallthrough -Wno-redundant-move -Wno-unused-variable -Wno-format -Wno-strict-aliasing -Wno-cast-function-type -c ../sources/gn-0+git/src/gn/command_args.cc -o src/gn/command_args.o
In file included from ../sources/gn-0+git/src/gn/header_checker.h:24,
from ../sources/gn-0+git/src/gn/commands.h:20,
from ../sources/gn-0+git/src/gn/command_args.cc:18:
../sources/gn-0+git/src/gn/err.h:8:10: fatal error: expected: No such file or directory
8 | #include <expected>
| ^~~~~~~~~~
compilation terminated.
[30/216] g++ -MMD -MF src/gn/command_check.o.d -I../sources/gn-0+git/src -I../sources/gn-0+git/src/gn/starlark/vendor/cxx/include -I. -isystemTOPDIR/tmp/work/x86_64-linux/gn-native/0+git/recipe-sysroot-native/usr/include -O2 -pipe -Wno-error=maybe-uninitialized -isystemTOPDIR/tmp/work/x86_64-linux/gn-native/0+git/recipe-sysroot-native/usr/include -O2 -pipe -fvisibility-inlines-hidden -DNDEBUG -O3 -g -fdata-sections -ffunction-sections -D_FILE_OFFSET_BITS=64 -D__STDC_CONSTANT_MACROS -D__STDC_FORMAT_MACROS -pthread -pipe -fno-exceptions -fno-rtti -fdiagnostics-color -Wall -Wextra -Wno-unused-parameter -Wextra-semi -Wundef -std=c++23 -Wno-redundant-move -Wno-restrict -Wno-deprecated-copy -Wno-implicit-fallthrough -Wno-redundant-move -Wno-unused-variable -Wno-format -Wno-strict-aliasing -Wno-cast-function-type -c ../sources/gn-0+git/src/gn/command_check.cc -o src/gn/command_check.o
FAILED: [code=1] src/gn/command_check.o
g++ -MMD -MF src/gn/command_check.o.d -I../sources/gn-0+git/src -I../sources/gn-0+git/src/gn/starlark/vendor/cxx/include -I. -isystemTOPDIR/tmp/work/x86_64-linux/gn-native/0+git/recipe-sysroot-native/usr/include -O2 -pipe -Wno-error=maybe-uninitialized -isystemTOPDIR/tmp/work/x86_64-linux/gn-native/0+git/recipe-sysroot-native/usr/include -O2 -pipe -fvisibility-inlines-hidden -DNDEBUG -O3 -g -fdata-sections -ffunction-sections -D_FILE_OFFSET_BITS=64 -D__STDC_CONSTANT_MACROS -D__STDC_FORMAT_MACROS -pthread -pipe -fno-exceptions -fno-rtti -fdiagnostics-color -Wall -Wextra -Wno-unused-parameter -Wextra-semi -Wundef -std=c++23 -Wno-redundant-move -Wno-restrict -Wno-deprecated-copy -Wno-implicit-fallthrough -Wno-redundant-move -Wno-unused-variable -Wno-format -Wno-strict-aliasing -Wno-cast-function-type -c ../sources/gn-0+git/src/gn/command_check.cc -o src/gn/command_check.o
In file included from ../sources/gn-0+git/src/gn/header_checker.h:24,
from ../sources/gn-0+git/src/gn/commands.h:20,
from ../sources/gn-0+git/src/gn/command_check.cc:11:
../sources/gn-0+git/src/gn/err.h:8:10: fatal error: expected: No such file or directory
8 | #include <expected>
| ^~~~~~~~~~
compilation terminated.
[31/216] g++ -MMD -MF src/gn/command_clean.o.d -I../sources/gn-0+git/src -I../sources/gn-0+git/src/gn/starlark/vendor/cxx/include -I. -isystemTOPDIR/tmp/work/x86_64-linux/gn-native/0+git/recipe-sysroot-native/usr/include -O2 -pipe -Wno-error=maybe-uninitialized -isystemTOPDIR/tmp/work/x86_64-linux/gn-native/0+git/recipe-sysroot-native/usr/include -O2 -pipe -fvisibility-inlines-hidden -DNDEBUG -O3 -g -fdata-sections -ffunction-sections -D_FILE_OFFSET_BITS=64 -D__STDC_CONSTANT_MACROS -D__STDC_FORMAT_MACROS -pthread -pipe -fno-exceptions -fno-rtti -fdiagnostics-color -Wall -Wextra -Wno-unused-parameter -Wextra-semi -Wundef -std=c++23 -Wno-redundant-move -Wno-restrict -Wno-deprecated-copy -Wno-implicit-fallthrough -Wno-redundant-move -Wno-unused-variable -Wno-format -Wno-strict-aliasing -Wno-cast-function-type -c ../sources/gn-0+git/src/gn/command_clean.cc -o src/gn/command_clean.o
FAILED: [code=1] src/gn/command_clean.o
g++ -MMD -MF src/gn/command_clean.o.d -I../sources/gn-0+git/src -I../sources/gn-0+git/src/gn/starlark/vendor/cxx/include -I. -isystemTOPDIR/tmp/work/x86_64-linux/gn-native/0+git/recipe-sysroot-native/usr/include -O2 -pipe -Wno-error=maybe-uninitialized -isystemTOPDIR/tmp/work/x86_64-linux/gn-native/0+git/recipe-sysroot-native/usr/include -O2 -pipe -fvisibility-inlines-hidden -DNDEBUG -O3 -g -fdata-sections -ffunction-sections -D_FILE_OFFSET_BITS=64 -D__STDC_CONSTANT_MACROS -D__STDC_FORMAT_MACROS -pthread -pipe -fno-exceptions -fno-rtti -fdiagnostics-color -Wall -Wextra -Wno-unused-parameter -Wextra-semi -Wundef -std=c++23 -Wno-redundant-move -Wno-restrict -Wno-deprecated-copy -Wno-implicit-fallthrough -Wno-redundant-move -Wno-unused-variable -Wno-format -Wno-strict-aliasing -Wno-cast-function-type -c ../sources/gn-0+git/src/gn/command_clean.cc -o src/gn/command_clean.o
In file included from ../sources/gn-0+git/src/gn/header_checker.h:24,
from ../sources/gn-0+git/src/gn/commands.h:20,
from ../sources/gn-0+git/src/gn/command_clean.cc:10:
../sources/gn-0+git/src/gn/err.h:8:10: fatal error: expected: No such file or directory
8 | #include <expected>
| ^~~~~~~~~~
compilation terminated.
[32/216] g++ -MMD -MF src/gn/command_clean_stale.o.d -I../sources/gn-0+git/src -I../sources/gn-0+git/src/gn/starlark/vendor/cxx/include -I. -isystemTOPDIR/tmp/work/x86_64-linux/gn-native/0+git/recipe-sysroot-native/usr/include -O2 -pipe -Wno-error=maybe-uninitialized -isystemTOPDIR/tmp/work/x86_64-linux/gn-native/0+git/recipe-sysroot-native/usr/include -O2 -pipe -fvisibility-inlines-hidden -DNDEBUG -O3 -g -fdata-sections -ffunction-sections -D_FILE_OFFSET_BITS=64 -D__STDC_CONSTANT_MACROS -D__STDC_FORMAT_MACROS -pthread -pipe -fno-exceptions -fno-rtti -fdiagnostics-color -Wall -Wextra -Wno-unused-parameter -Wextra-semi -Wundef -std=c++23 -Wno-redundant-move -Wno-restrict -Wno-deprecated-copy -Wno-implicit-fallthrough -Wno-redundant-move -Wno-unused-variable -Wno-format -Wno-strict-aliasing -Wno-cast-function-type -c ../sources/gn-0+git/src/gn/command_clean_stale.cc -o src/gn/command_clean_stale.o
FAILED: [code=1] src/gn/command_clean_stale.o
g++ -MMD -MF src/gn/command_clean_stale.o.d -I../sources/gn-0+git/src -I../sources/gn-0+git/src/gn/starlark/vendor/cxx/include -I. -isystemTOPDIR/tmp/work/x86_64-linux/gn-native/0+git/recipe-sysroot-native/usr/include -O2 -pipe -Wno-error=maybe-uninitialized -isystemTOPDIR/tmp/work/x86_64-linux/gn-native/0+git/recipe-sysroot-native/usr/include -O2 -pipe -fvisibility-inlines-hidden -DNDEBUG -O3 -g -fdata-sections -ffunction-sections -D_FILE_OFFSET_BITS=64 -D__STDC_CONSTANT_MACROS -D__STDC_FORMAT_MACROS -pthread -pipe -fno-exceptions -fno-rtti -fdiagnostics-color -Wall -Wextra -Wno-unused-parameter -Wextra-semi -Wundef -std=c++23 -Wno-redundant-move -Wno-restrict -Wno-deprecated-copy -Wno-implicit-fallthrough -Wno-redundant-move -Wno-unused-variable -Wno-format -Wno-strict-aliasing -Wno-cast-function-type -c ../sources/gn-0+git/src/gn/command_clean_stale.cc -o src/gn/command_clean_stale.o
In file included from ../sources/gn-0+git/src/gn/header_checker.h:24,
from ../sources/gn-0+git/src/gn/commands.h:20,
from ../sources/gn-0+git/src/gn/command_clean_stale.cc:9:
../sources/gn-0+git/src/gn/err.h:8:10: fatal error: expected: No such file or directory
8 | #include <expected>
| ^~~~~~~~~~
compilation terminated.
[33/216] g++ -MMD -MF src/gn/command_desc.o.d -I../sources/gn-0+git/src -I../sources/gn-0+git/src/gn/starlark/vendor/cxx/include -I. -isystemTOPDIR/tmp/work/x86_64-linux/gn-native/0+git/recipe-sysroot-native/usr/include -O2 -pipe -Wno-error=maybe-uninitialized -isystemTOPDIR/tmp/work/x86_64-linux/gn-native/0+git/recipe-sysroot-native/usr/include -O2 -pipe -fvisibility-inlines-hidden -DNDEBUG -O3 -g -fdata-sections -ffunction-sections -D_FILE_OFFSET_BITS=64 -D__STDC_CONSTANT_MACROS -D__STDC_FORMAT_MACROS -pthread -pipe -fno-exceptions -fno-rtti -fdiagnostics-color -Wall -Wextra -Wno-unused-parameter -Wextra-semi -Wundef -std=c++23 -Wno-redundant-move -Wno-restrict -Wno-deprecated-copy -Wno-implicit-fallthrough -Wno-redundant-move -Wno-unused-variable -Wno-format -Wno-strict-aliasing -Wno-cast-function-type -c ../sources/gn-0+git/src/gn/command_desc.cc -o src/gn/command_desc.o
FAILED: [code=1] src/gn/command_desc.o
g++ -MMD -MF src/gn/command_desc.o.d -I../sources/gn-0+git/src -I../sources/gn-0+git/src/gn/starlark/vendor/cxx/include -I. -isystemTOPDIR/tmp/work/x86_64-linux/gn-native/0+git/recipe-sysroot-native/usr/include -O2 -pipe -Wno-error=maybe-uninitialized -isystemTOPDIR/tmp/work/x86_64-linux/gn-native/0+git/recipe-sysroot-native/usr/include -O2 -pipe -fvisibility-inlines-hidden -DNDEBUG -O3 -g -fdata-sections -ffunction-sections -D_FILE_OFFSET_BITS=64 -D__STDC_CONSTANT_MACROS -D__STDC_FORMAT_MACROS -pthread -pipe -fno-exceptions -fno-rtti -fdiagnostics-color -Wall -Wextra -Wno-unused-parameter -Wextra-semi -Wundef -std=c++23 -Wno-redundant-move -Wno-restrict -Wno-deprecated-copy -Wno-implicit-fallthrough -Wno-redundant-move -Wno-unused-variable -Wno-format -Wno-strict-aliasing -Wno-cast-function-type -c ../sources/gn-0+git/src/gn/command_desc.cc -o src/gn/command_desc.o
In file included from ../sources/gn-0+git/src/gn/header_checker.h:24,
from ../sources/gn-0+git/src/gn/commands.h:20,
from ../sources/gn-0+git/src/gn/command_desc.cc:16:
../sources/gn-0+git/src/gn/err.h:8:10: fatal error: expected: No such file or directory
8 | #include <expected>
| ^~~~~~~~~~
compilation terminated.
[34/216] g++ -MMD -MF src/gn/command_format.o.d -I../sources/gn-0+git/src -I../sources/gn-0+git/src/gn/starlark/vendor/cxx/include -I. -isystemTOPDIR/tmp/work/x86_64-linux/gn-native/0+git/recipe-sysroot-native/usr/include -O2 -pipe -Wno-error=maybe-uninitialized -isystemTOPDIR/tmp/work/x86_64-linux/gn-native/0+git/recipe-sysroot-native/usr/include -O2 -pipe -fvisibility-inlines-hidden -DNDEBUG -O3 -g -fdata-sections -ffunction-sections -D_FILE_OFFSET_BITS=64 -D__STDC_CONSTANT_MACROS -D__STDC_FORMAT_MACROS -pthread -pipe -fno-exceptions -fno-rtti -fdiagnostics-color -Wall -Wextra -Wno-unused-parameter -Wextra-semi -Wundef -std=c++23 -Wno-redundant-move -Wno-restrict -Wno-deprecated-copy -Wno-implicit-fallthrough -Wno-redundant-move -Wno-unused-variable -Wno-format -Wno-strict-aliasing -Wno-cast-function-type -c ../sources/gn-0+git/src/gn/command_format.cc -o src/gn/command_format.o
FAILED: [code=1] src/gn/command_format.o
g++ -MMD -MF src/gn/command_format.o.d -I../sources/gn-0+git/src -I../sources/gn-0+git/src/gn/starlark/vendor/cxx/include -I. -isystemTOPDIR/tmp/work/x86_64-linux/gn-native/0+git/recipe-sysroot-native/usr/include -O2 -pipe -Wno-error=maybe-uninitialized -isystemTOPDIR/tmp/work/x86_64-linux/gn-native/0+git/recipe-sysroot-native/usr/include -O2 -pipe -fvisibility-inlines-hidden -DNDEBUG -O3 -g -fdata-sections -ffunction-sections -D_FILE_OFFSET_BITS=64 -D__STDC_CONSTANT_MACROS -D__STDC_FORMAT_MACROS -pthread -pipe -fno-exceptions -fno-rtti -fdiagnostics-color -Wall -Wextra -Wno-unused-parameter -Wextra-semi -Wundef -std=c++23 -Wno-redundant-move -Wno-restrict -Wno-deprecated-copy -Wno-implicit-fallthrough -Wno-redundant-move -Wno-unused-variable -Wno-format -Wno-strict-aliasing -Wno-cast-function-type -c ../sources/gn-0+git/src/gn/command_format.cc -o src/gn/command_format.o
In file included from ../sources/gn-0+git/src/gn/command_format.h:10,
from ../sources/gn-0+git/src/gn/command_format.cc:5:
../sources/gn-0+git/src/gn/err.h:8:10: fatal error: expected: No such file or directory
8 | #include <expected>
| ^~~~~~~~~~
compilation terminated.
[35/216] g++ -MMD -MF src/gn/command_gen.o.d -I../sources/gn-0+git/src -I../sources/gn-0+git/src/gn/starlark/vendor/cxx/include -I. -isystemTOPDIR/tmp/work/x86_64-linux/gn-native/0+git/recipe-sysroot-native/usr/include -O2 -pipe -Wno-error=maybe-uninitialized -isystemTOPDIR/tmp/work/x86_64-linux/gn-native/0+git/recipe-sysroot-native/usr/include -O2 -pipe -fvisibility-inlines-hidden -DNDEBUG -O3 -g -fdata-sections -ffunction-sections -D_FILE_OFFSET_BITS=64 -D__STDC_CONSTANT_MACROS -D__STDC_FORMAT_MACROS -pthread -pipe -fno-exceptions -fno-rtti -fdiagnostics-color -Wall -Wextra -Wno-unused-parameter -Wextra-semi -Wundef -std=c++23 -Wno-redundant-move -Wno-restrict -Wno-deprecated-copy -Wno-implicit-fallthrough -Wno-redundant-move -Wno-unused-variable -Wno-format -Wno-strict-aliasing -Wno-cast-function-type -c ../sources/gn-0+git/src/gn/command_gen.cc -o src/gn/command_gen.o
FAILED: [code=1] src/gn/command_gen.o
g++ -MMD -MF src/gn/command_gen.o.d -I../sources/gn-0+git/src -I../sources/gn-0+git/src/gn/starlark/vendor/cxx/include -I. -isystemTOPDIR/tmp/work/x86_64-linux/gn-native/0+git/recipe-sysroot-native/usr/include -O2 -pipe -Wno-error=maybe-uninitialized -isystemTOPDIR/tmp/work/x86_64-linux/gn-native/0+git/recipe-sysroot-native/usr/include -O2 -pipe -fvisibility-inlines-hidden -DNDEBUG -O3 -g -fdata-sections -ffunction-sections -D_FILE_OFFSET_BITS=64 -D__STDC_CONSTANT_MACROS -D__STDC_FORMAT_MACROS -pthread -pipe -fno-exceptions -fno-rtti -fdiagnostics-color -Wall -Wextra -Wno-unused-parameter -Wextra-semi -Wundef -std=c++23 -Wno-redundant-move -Wno-restrict -Wno-deprecated-copy -Wno-implicit-fallthrough -Wno-redundant-move -Wno-unused-variable -Wno-format -Wno-strict-aliasing -Wno-cast-function-type -c ../sources/gn-0+git/src/gn/command_gen.cc -o src/gn/command_gen.o
In file included from ../sources/gn-0+git/src/gn/scope.h:19,
from ../sources/gn-0+git/src/gn/args.h:15,
from ../sources/gn-0+git/src/gn/build_settings.h:15,
from ../sources/gn-0+git/src/gn/command_gen.cc:16:
../sources/gn-0+git/src/gn/err.h:8:10: fatal error: expected: No such file or directory
8 | #include <expected>
| ^~~~~~~~~~
compilation terminated.
[36/216] g++ -MMD -MF src/gn/command_help.o.d -I../sources/gn-0+git/src -I../sources/gn-0+git/src/gn/starlark/vendor/cxx/include -I. -isystemTOPDIR/tmp/work/x86_64-linux/gn-native/0+git/recipe-sysroot-native/usr/include -O2 -pipe -Wno-error=maybe-uninitialized -isystemTOPDIR/tmp/work/x86_64-linux/gn-native/0+git/recipe-sysroot-native/usr/include -O2 -pipe -fvisibility-inlines-hidden -DNDEBUG -O3 -g -fdata-sections -ffunction-sections -D_FILE_OFFSET_BITS=64 -D__STDC_CONSTANT_MACROS -D__STDC_FORMAT_MACROS -pthread -pipe -fno-exceptions -fno-rtti -fdiagnostics-color -Wall -Wextra -Wno-unused-parameter -Wextra-semi -Wundef -std=c++23 -Wno-redundant-move -Wno-restrict -Wno-deprecated-copy -Wno-implicit-fallthrough -Wno-redundant-move -Wno-unused-variable -Wno-format -Wno-strict-aliasing -Wno-cast-function-type -c ../sources/gn-0+git/src/gn/command_help.cc -o src/gn/command_help.o
FAILED: [code=1] src/gn/command_help.o
g++ -MMD -MF src/gn/command_help.o.d -I../sources/gn-0+git/src -I../sources/gn-0+git/src/gn/starlark/vendor/cxx/include -I. -isystemTOPDIR/tmp/work/x86_64-linux/gn-native/0+git/recipe-sysroot-native/usr/include -O2 -pipe -Wno-error=maybe-uninitialized -isystemTOPDIR/tmp/work/x86_64-linux/gn-native/0+git/recipe-sysroot-native/usr/include -O2 -pipe -fvisibility-inlines-hidden -DNDEBUG -O3 -g -fdata-sections -ffunction-sections -D_FILE_OFFSET_BITS=64 -D__STDC_CONSTANT_MACROS -D__STDC_FORMAT_MACROS -pthread -pipe -fno-exceptions -fno-rtti -fdiagnostics-color -Wall -Wextra -Wno-unused-parameter -Wextra-semi -Wundef -std=c++23 -Wno-redundant-move -Wno-restrict -Wno-deprecated-copy -Wno-implicit-fallthrough -Wno-redundant-move -Wno-unused-variable -Wno-format -Wno-strict-aliasing -Wno-cast-function-type -c ../sources/gn-0+git/src/gn/command_help.cc -o src/gn/command_help.o
In file included from ../sources/gn-0+git/src/gn/scope.h:19,
from ../sources/gn-0+git/src/gn/args.h:15,
from ../sources/gn-0+git/src/gn/command_help.cc:6:
../sources/gn-0+git/src/gn/err.h:8:10: fatal error: expected: No such file or directory
8 | #include <expected>
| ^~~~~~~~~~
compilation terminated.
[37/216] g++ -MMD -MF src/gn/command_ls.o.d -I../sources/gn-0+git/src -I../sources/gn-0+git/src/gn/starlark/vendor/cxx/include -I. -isystemTOPDIR/tmp/work/x86_64-linux/gn-native/0+git/recipe-sysroot-native/usr/include -O2 -pipe -Wno-error=maybe-uninitialized -isystemTOPDIR/tmp/work/x86_64-linux/gn-native/0+git/recipe-sysroot-native/usr/include -O2 -pipe -fvisibility-inlines-hidden -DNDEBUG -O3 -g -fdata-sections -ffunction-sections -D_FILE_OFFSET_BITS=64 -D__STDC_CONSTANT_MACROS -D__STDC_FORMAT_MACROS -pthread -pipe -fno-exceptions -fno-rtti -fdiagnostics-color -Wall -Wextra -Wno-unused-parameter -Wextra-semi -Wundef -std=c++23 -Wno-redundant-move -Wno-restrict -Wno-deprecated-copy -Wno-implicit-fallthrough -Wno-redundant-move -Wno-unused-variable -Wno-format -Wno-strict-aliasing -Wno-cast-function-type -c ../sources/gn-0+git/src/gn/command_ls.cc -o src/gn/command_ls.o
FAILED: [code=1] src/gn/command_ls.o
g++ -MMD -MF src/gn/command_ls.o.d -I../sources/gn-0+git/src -I../sources/gn-0+git/src/gn/starlark/vendor/cxx/include -I. -isystemTOPDIR/tmp/work/x86_64-linux/gn-native/0+git/recipe-sysroot-native/usr/include -O2 -pipe -Wno-error=maybe-uninitialized -isystemTOPDIR/tmp/work/x86_64-linux/gn-native/0+git/recipe-sysroot-native/usr/include -O2 -pipe -fvisibility-inlines-hidden -DNDEBUG -O3 -g -fdata-sections -ffunction-sections -D_FILE_OFFSET_BITS=64 -D__STDC_CONSTANT_MACROS -D__STDC_FORMAT_MACROS -pthread -pipe -fno-exceptions -fno-rtti -fdiagnostics-color -Wall -Wextra -Wno-unused-parameter -Wextra-semi -Wundef -std=c++23 -Wno-redundant-move -Wno-restrict -Wno-deprecated-copy -Wno-implicit-fallthrough -Wno-redundant-move -Wno-unused-variable -Wno-format -Wno-strict-aliasing -Wno-cast-function-type -c ../sources/gn-0+git/src/gn/command_ls.cc -o src/gn/command_ls.o
In file included from ../sources/gn-0+git/src/gn/header_checker.h:24,
from ../sources/gn-0+git/src/gn/commands.h:20,
from ../sources/gn-0+git/src/gn/command_ls.cc:9:
../sources/gn-0+git/src/gn/err.h:8:10: fatal error: expected: No such file or directory
8 | #include <expected>
| ^~~~~~~~~~
compilation terminated.
[38/216] g++ -MMD -MF src/gn/command_meta.o.d -I../sources/gn-0+git/src -I../sources/gn-0+git/src/gn/starlark/vendor/cxx/include -I. -isystemTOPDIR/tmp/work/x86_64-linux/gn-native/0+git/recipe-sysroot-native/usr/include -O2 -pipe -Wno-error=maybe-uninitialized -isystemTOPDIR/tmp/work/x86_64-linux/gn-native/0+git/recipe-sysroot-native/usr/include -O2 -pipe -fvisibility-inlines-hidden -DNDEBUG -O3 -g -fdata-sections -ffunction-sections -D_FILE_OFFSET_BITS=64 -D__STDC_CONSTANT_MACROS -D__STDC_FORMAT_MACROS -pthread -pipe -fno-exceptions -fno-rtti -fdiagnostics-color -Wall -Wextra -Wno-unused-parameter -Wextra-semi -Wundef -std=c++23 -Wno-redundant-move -Wno-restrict -Wno-deprecated-copy -Wno-implicit-fallthrough -Wno-redundant-move -Wno-unused-variable -Wno-format -Wno-strict-aliasing -Wno-cast-function-type -c ../sources/gn-0+git/src/gn/command_meta.cc -o src/gn/command_meta.o
FAILED: [code=1] src/gn/command_meta.o
g++ -MMD -MF src/gn/command_meta.o.d -I../sources/gn-0+git/src -I../sources/gn-0+git/src/gn/starlark/vendor/cxx/include -I. -isystemTOPDIR/tmp/work/x86_64-linux/gn-native/0+git/recipe-sysroot-native/usr/include -O2 -pipe -Wno-error=maybe-uninitialized -isystemTOPDIR/tmp/work/x86_64-linux/gn-native/0+git/recipe-sysroot-native/usr/include -O2 -pipe -fvisibility-inlines-hidden -DNDEBUG -O3 -g -fdata-sections -ffunction-sections -D_FILE_OFFSET_BITS=64 -D__STDC_CONSTANT_MACROS -D__STDC_FORMAT_MACROS -pthread -pipe -fno-exceptions -fno-rtti -fdiagnostics-color -Wall -Wextra -Wno-unused-parameter -Wextra-semi -Wundef -std=c++23 -Wno-redundant-move -Wno-restrict -Wno-deprecated-copy -Wno-implicit-fallthrough -Wno-redundant-move -Wno-unused-variable -Wno-format -Wno-strict-aliasing -Wno-cast-function-type -c ../sources/gn-0+git/src/gn/command_meta.cc -o src/gn/command_meta.o
In file included from ../sources/gn-0+git/src/gn/header_checker.h:24,
from ../sources/gn-0+git/src/gn/commands.h:20,
from ../sources/gn-0+git/src/gn/command_meta.cc:10:
../sources/gn-0+git/src/gn/err.h:8:10: fatal error: expected: No such file or directory
8 | #include <expected>
| ^~~~~~~~~~
compilation terminated.
[39/216] g++ -MMD -MF src/gn/command_path.o.d -I../sources/gn-0+git/src -I../sources/gn-0+git/src/gn/starlark/vendor/cxx/include -I. -isystemTOPDIR/tmp/work/x86_64-linux/gn-native/0+git/recipe-sysroot-native/usr/include -O2 -pipe -Wno-error=maybe-uninitialized -isystemTOPDIR/tmp/work/x86_64-linux/gn-native/0+git/recipe-sysroot-native/usr/include -O2 -pipe -fvisibility-inlines-hidden -DNDEBUG -O3 -g -fdata-sections -ffunction-sections -D_FILE_OFFSET_BITS=64 -D__STDC_CONSTANT_MACROS -D__STDC_FORMAT_MACROS -pthread -pipe -fno-exceptions -fno-rtti -fdiagnostics-color -Wall -Wextra -Wno-unused-parameter -Wextra-semi -Wundef -std=c++23 -Wno-redundant-move -Wno-restrict -Wno-deprecated-copy -Wno-implicit-fallthrough -Wno-redundant-move -Wno-unused-variable -Wno-format -Wno-strict-aliasing -Wno-cast-function-type -c ../sources/gn-0+git/src/gn/command_path.cc -o src/gn/command_path.o
FAILED: [code=1] src/gn/command_path.o
g++ -MMD -MF src/gn/command_path.o.d -I../sources/gn-0+git/src -I../sources/gn-0+git/src/gn/starlark/vendor/cxx/include -I. -isystemTOPDIR/tmp/work/x86_64-linux/gn-native/0+git/recipe-sysroot-native/usr/include -O2 -pipe -Wno-error=maybe-uninitialized -isystemTOPDIR/tmp/work/x86_64-linux/gn-native/0+git/recipe-sysroot-native/usr/include -O2 -pipe -fvisibility-inlines-hidden -DNDEBUG -O3 -g -fdata-sections -ffunction-sections -D_FILE_OFFSET_BITS=64 -D__STDC_CONSTANT_MACROS -D__STDC_FORMAT_MACROS -pthread -pipe -fno-exceptions -fno-rtti -fdiagnostics-color -Wall -Wextra -Wno-unused-parameter -Wextra-semi -Wundef -std=c++23 -Wno-redundant-move -Wno-restrict -Wno-deprecated-copy -Wno-implicit-fallthrough -Wno-redundant-move -Wno-unused-variable -Wno-format -Wno-strict-aliasing -Wno-cast-function-type -c ../sources/gn-0+git/src/gn/command_path.cc -o src/gn/command_path.o
In file included from ../sources/gn-0+git/src/gn/header_checker.h:24,
from ../sources/gn-0+git/src/gn/commands.h:20,
from ../sources/gn-0+git/src/gn/command_path.cc:11:
../sources/gn-0+git/src/gn/err.h:8:10: fatal error: expected: No such file or directory
8 | #include <expected>
| ^~~~~~~~~~
compilation terminated.
[40/216] g++ -MMD -MF src/gn/command_suggest.o.d -I../sources/gn-0+git/src -I../sources/gn-0+git/src/gn/starlark/vendor/cxx/include -I. -isystemTOPDIR/tmp/work/x86_64-linux/gn-native/0+git/recipe-sysroot-native/usr/include -O2 -pipe -Wno-error=maybe-uninitialized -isystemTOPDIR/tmp/work/x86_64-linux/gn-native/0+git/recipe-sysroot-native/usr/include -O2 -pipe -fvisibility-inlines-hidden -DNDEBUG -O3 -g -fdata-sections -ffunction-sections -D_FILE_OFFSET_BITS=64 -D__STDC_CONSTANT_MACROS -D__STDC_FORMAT_MACROS -pthread -pipe -fno-exceptions -fno-rtti -fdiagnostics-color -Wall -Wextra -Wno-unused-parameter -Wextra-semi -Wundef -std=c++23 -Wno-redundant-move -Wno-restrict -Wno-deprecated-copy -Wno-implicit-fallthrough -Wno-redundant-move -Wno-unused-variable -Wno-format -Wno-strict-aliasing -Wno-cast-function-type -c ../sources/gn-0+git/src/gn/command_suggest.cc -o src/gn/command_suggest.o
FAILED: [code=1] src/gn/command_suggest.o
g++ -MMD -MF src/gn/command_suggest.o.d -I../sources/gn-0+git/src -I../sources/gn-0+git/src/gn/starlark/vendor/cxx/include -I. -isystemTOPDIR/tmp/work/x86_64-linux/gn-native/0+git/recipe-sysroot-native/usr/include -O2 -pipe -Wno-error=maybe-uninitialized -isystemTOPDIR/tmp/work/x86_64-linux/gn-native/0+git/recipe-sysroot-native/usr/include -O2 -pipe -fvisibility-inlines-hidden -DNDEBUG -O3 -g -fdata-sections -ffunction-sections -D_FILE_OFFSET_BITS=64 -D__STDC_CONSTANT_MACROS -D__STDC_FORMAT_MACROS -pthread -pipe -fno-exceptions -fno-rtti -fdiagnostics-color -Wall -Wextra -Wno-unused-parameter -Wextra-semi -Wundef -std=c++23 -Wno-redundant-move -Wno-restrict -Wno-deprecated-copy -Wno-implicit-fallthrough -Wno-redundant-move -Wno-unused-variable -Wno-format -Wno-strict-aliasing -Wno-cast-function-type -c ../sources/gn-0+git/src/gn/command_suggest.cc -o src/gn/command_suggest.o
In file included from ../sources/gn-0+git/src/gn/header_checker.h:24,
from ../sources/gn-0+git/src/gn/commands.h:20,
from ../sources/gn-0+git/src/gn/command_suggest.cc:19:
../sources/gn-0+git/src/gn/err.h:8:10: fatal error: expected: No such file or directory
8 | #include <expected>
| ^~~~~~~~~~
compilation terminated.
[41/216] g++ -MMD -MF src/gn/commands.o.d -I../sources/gn-0+git/src -I../sources/gn-0+git/src/gn/starlark/vendor/cxx/include -I. -isystemTOPDIR/tmp/work/x86_64-linux/gn-native/0+git/recipe-sysroot-native/usr/include -O2 -pipe -Wno-error=maybe-uninitialized -isystemTOPDIR/tmp/work/x86_64-linux/gn-native/0+git/recipe-sysroot-native/usr/include -O2 -pipe -fvisibility-inlines-hidden -DNDEBUG -O3 -g -fdata-sections -ffunction-sections -D_FILE_OFFSET_BITS=64 -D__STDC_CONSTANT_MACROS -D__STDC_FORMAT_MACROS -pthread -pipe -fno-exceptions -fno-rtti -fdiagnostics-color -Wall -Wextra -Wno-unused-parameter -Wextra-semi -Wundef -std=c++23 -Wno-redundant-move -Wno-restrict -Wno-deprecated-copy -Wno-implicit-fallthrough -Wno-redundant-move -Wno-unused-variable -Wno-format -Wno-strict-aliasing -Wno-cast-function-type -c ../sources/gn-0+git/src/gn/commands.cc -o src/gn/commands.o
FAILED: [code=1] src/gn/commands.o
g++ -MMD -MF src/gn/commands.o.d -I../sources/gn-0+git/src -I../sources/gn-0+git/src/gn/starlark/vendor/cxx/include -I. -isystemTOPDIR/tmp/work/x86_64-linux/gn-native/0+git/recipe-sysroot-native/usr/include -O2 -pipe -Wno-error=maybe-uninitialized -isystemTOPDIR/tmp/work/x86_64-linux/gn-native/0+git/recipe-sysroot-native/usr/include -O2 -pipe -fvisibility-inlines-hidden -DNDEBUG -O3 -g -fdata-sections -ffunction-sections -D_FILE_OFFSET_BITS=64 -D__STDC_CONSTANT_MACROS -D__STDC_FORMAT_MACROS -pthread -pipe -fno-exceptions -fno-rtti -fdiagnostics-color -Wall -Wextra -Wno-unused-parameter -Wextra-semi -Wundef -std=c++23 -Wno-redundant-move -Wno-restrict -Wno-deprecated-copy -Wno-implicit-fallthrough -Wno-redundant-move -Wno-unused-variable -Wno-format -Wno-strict-aliasing -Wno-cast-function-type -c ../sources/gn-0+git/src/gn/commands.cc -o src/gn/commands.o
In file included from ../sources/gn-0+git/src/gn/header_checker.h:24,
from ../sources/gn-0+git/src/gn/commands.h:20,
from ../sources/gn-0+git/src/gn/commands.cc:5:
../sources/gn-0+git/src/gn/err.h:8:10: fatal error: expected: No such file or directory
8 | #include <expected>
| ^~~~~~~~~~
compilation terminated.
[42/216] g++ -MMD -MF src/gn/compile_commands_writer.o.d -I../sources/gn-0+git/src -I../sources/gn-0+git/src/gn/starlark/vendor/cxx/include -I. -isystemTOPDIR/tmp/work/x86_64-linux/gn-native/0+git/recipe-sysroot-native/usr/include -O2 -pipe -Wno-error=maybe-uninitialized -isystemTOPDIR/tmp/work/x86_64-linux/gn-native/0+git/recipe-sysroot-native/usr/include -O2 -pipe -fvisibility-inlines-hidden -DNDEBUG -O3 -g -fdata-sections -ffunction-sections -D_FILE_OFFSET_BITS=64 -D__STDC_CONSTANT_MACROS -D__STDC_FORMAT_MACROS -pthread -pipe -fno-exceptions -fno-rtti -fdiagnostics-color -Wall -Wextra -Wno-unused-parameter -Wextra-semi -Wundef -std=c++23 -Wno-redundant-move -Wno-restrict -Wno-deprecated-copy -Wno-implicit-fallthrough -Wno-redundant-move -Wno-unused-variable -Wno-format -Wno-strict-aliasing -Wno-cast-function-type -c ../sources/gn-0+git/src/gn/compile_commands_writer.cc -o src/gn/compile_commands_writer.o
FAILED: [code=1] src/gn/compile_commands_writer.o
g++ -MMD -MF src/gn/compile_commands_writer.o.d -I../sources/gn-0+git/src -I../sources/gn-0+git/src/gn/starlark/vendor/cxx/include -I. -isystemTOPDIR/tmp/work/x86_64-linux/gn-native/0+git/recipe-sysroot-native/usr/include -O2 -pipe -Wno-error=maybe-uninitialized -isystemTOPDIR/tmp/work/x86_64-linux/gn-native/0+git/recipe-sysroot-native/usr/include -O2 -pipe -fvisibility-inlines-hidden -DNDEBUG -O3 -g -fdata-sections -ffunction-sections -D_FILE_OFFSET_BITS=64 -D__STDC_CONSTANT_MACROS -D__STDC_FORMAT_MACROS -pthread -pipe -fno-exceptions -fno-rtti -fdiagnostics-color -Wall -Wextra -Wno-unused-parameter -Wextra-semi -Wundef -std=c++23 -Wno-redundant-move -Wno-restrict -Wno-deprecated-copy -Wno-implicit-fallthrough -Wno-redundant-move -Wno-unused-variable -Wno-format -Wno-strict-aliasing -Wno-cast-function-type -c ../sources/gn-0+git/src/gn/compile_commands_writer.cc -o src/gn/compile_commands_writer.o
In file included from ../sources/gn-0+git/src/gn/compile_commands_writer.h:11,
from ../sources/gn-0+git/src/gn/compile_commands_writer.cc:5:
../sources/gn-0+git/src/gn/err.h:8:10: fatal error: expected: No such file or directory
8 | #include <expected>
| ^~~~~~~~~~
compilation terminated.
[43/216] g++ -MMD -MF src/gn/rust_project_writer.o.d -I../sources/gn-0+git/src -I../sources/gn-0+git/src/gn/starlark/vendor/cxx/include -I. -isystemTOPDIR/tmp/work/x86_64-linux/gn-native/0+git/recipe-sysroot-native/usr/include -O2 -pipe -Wno-error=maybe-uninitialized -isystemTOPDIR/tmp/work/x86_64-linux/gn-native/0+git/recipe-sysroot-native/usr/include -O2 -pipe -fvisibility-inlines-hidden -DNDEBUG -O3 -g -fdata-sections -ffunction-sections -D_FILE_OFFSET_BITS=64 -D__STDC_CONSTANT_MACROS -D__STDC_FORMAT_MACROS -pthread -pipe -fno-exceptions -fno-rtti -fdiagnostics-color -Wall -Wextra -Wno-unused-parameter -Wextra-semi -Wundef -std=c++23 -Wno-redundant-move -Wno-restrict -Wno-deprecated-copy -Wno-implicit-fallthrough -Wno-redundant-move -Wno-unused-variable -Wno-format -Wno-strict-aliasing -Wno-cast-function-type -c ../sources/gn-0+git/src/gn/rust_project_writer.cc -o src/gn/rust_project_writer.o
FAILED: [code=1] src/gn/rust_project_writer.o
g++ -MMD -MF src/gn/rust_project_writer.o.d -I../sources/gn-0+git/src -I../sources/gn-0+git/src/gn/starlark/vendor/cxx/include -I. -isystemTOPDIR/tmp/work/x86_64-linux/gn-native/0+git/recipe-sysroot-native/usr/include -O2 -pipe -Wno-error=maybe-uninitialized -isystemTOPDIR/tmp/work/x86_64-linux/gn-native/0+git/recipe-sysroot-native/usr/include -O2 -pipe -fvisibility-inlines-hidden -DNDEBUG -O3 -g -fdata-sections -ffunction-sections -D_FILE_OFFSET_BITS=64 -D__STDC_CONSTANT_MACROS -D__STDC_FORMAT_MACROS -pthread -pipe -fno-exceptions -fno-rtti -fdiagnostics-color -Wall -Wextra -Wno-unused-parameter -Wextra-semi -Wundef -std=c++23 -Wno-redundant-move -Wno-restrict -Wno-deprecated-copy -Wno-implicit-fallthrough -Wno-redundant-move -Wno-unused-variable -Wno-format -Wno-strict-aliasing -Wno-cast-function-type -c ../sources/gn-0+git/src/gn/rust_project_writer.cc -o src/gn/rust_project_writer.o
In file included from ../sources/gn-0+git/src/gn/rust_project_writer.h:8,
from ../sources/gn-0+git/src/gn/rust_project_writer.cc:5:
../sources/gn-0+git/src/gn/err.h:8:10: fatal error: expected: No such file or directory
8 | #include <expected>
| ^~~~~~~~~~
compilation terminated.
[44/216] g++ -MMD -MF src/gn/config.o.d -I../sources/gn-0+git/src -I../sources/gn-0+git/src/gn/starlark/vendor/cxx/include -I. -isystemTOPDIR/tmp/work/x86_64-linux/gn-native/0+git/recipe-sysroot-native/usr/include -O2 -pipe -Wno-error=maybe-uninitialized -isystemTOPDIR/tmp/work/x86_64-linux/gn-native/0+git/recipe-sysroot-native/usr/include -O2 -pipe -fvisibility-inlines-hidden -DNDEBUG -O3 -g -fdata-sections -ffunction-sections -D_FILE_OFFSET_BITS=64 -D__STDC_CONSTANT_MACROS -D__STDC_FORMAT_MACROS -pthread -pipe -fno-exceptions -fno-rtti -fdiagnostics-color -Wall -Wextra -Wno-unused-parameter -Wextra-semi -Wundef -std=c++23 -Wno-redundant-move -Wno-restrict -Wno-deprecated-copy -Wno-implicit-fallthrough -Wno-redundant-move -Wno-unused-variable -Wno-format -Wno-strict-aliasing -Wno-cast-function-type -c ../sources/gn-0+git/src/gn/config.cc -o src/gn/config.o
FAILED: [code=1] src/gn/config.o
g++ -MMD -MF src/gn/config.o.d -I../sources/gn-0+git/src -I../sources/gn-0+git/src/gn/starlark/vendor/cxx/include -I. -isystemTOPDIR/tmp/work/x86_64-linux/gn-native/0+git/recipe-sysroot-native/usr/include -O2 -pipe -Wno-error=maybe-uninitialized -isystemTOPDIR/tmp/work/x86_64-linux/gn-native/0+git/recipe-sysroot-native/usr/include -O2 -pipe -fvisibility-inlines-hidden -DNDEBUG -O3 -g -fdata-sections -ffunction-sections -D_FILE_OFFSET_BITS=64 -D__STDC_CONSTANT_MACROS -D__STDC_FORMAT_MACROS -pthread -pipe -fno-exceptions -fno-rtti -fdiagnostics-color -Wall -Wextra -Wno-unused-parameter -Wextra-semi -Wundef -std=c++23 -Wno-redundant-move -Wno-restrict -Wno-deprecated-copy -Wno-implicit-fallthrough -Wno-redundant-move -Wno-unused-variable -Wno-format -Wno-strict-aliasing -Wno-cast-function-type -c ../sources/gn-0+git/src/gn/config.cc -o src/gn/config.o
In file included from ../sources/gn-0+git/src/gn/config.cc:7:
../sources/gn-0+git/src/gn/err.h:8:10: fatal error: expected: No such file or directory
8 | #include <expected>
| ^~~~~~~~~~
compilation terminated.
[45/216] g++ -MMD -MF src/gn/config_values_extractors.o.d -I../sources/gn-0+git/src -I../sources/gn-0+git/src/gn/starlark/vendor/cxx/include -I. -isystemTOPDIR/tmp/work/x86_64-linux/gn-native/0+git/recipe-sysroot-native/usr/include -O2 -pipe -Wno-error=maybe-uninitialized -isystemTOPDIR/tmp/work/x86_64-linux/gn-native/0+git/recipe-sysroot-native/usr/include -O2 -pipe -fvisibility-inlines-hidden -DNDEBUG -O3 -g -fdata-sections -ffunction-sections -D_FILE_OFFSET_BITS=64 -D__STDC_CONSTANT_MACROS -D__STDC_FORMAT_MACROS -pthread -pipe -fno-exceptions -fno-rtti -fdiagnostics-color -Wall -Wextra -Wno-unused-parameter -Wextra-semi -Wundef -std=c++23 -Wno-redundant-move -Wno-restrict -Wno-deprecated-copy -Wno-implicit-fallthrough -Wno-redundant-move -Wno-unused-variable -Wno-format -Wno-strict-aliasing -Wno-cast-function-type -c ../sources/gn-0+git/src/gn/config_values_extractors.cc -o src/gn/config_values_extractors.o
FAILED: [code=1] src/gn/config_values_extractors.o
g++ -MMD -MF src/gn/config_values_extractors.o.d -I../sources/gn-0+git/src -I../sources/gn-0+git/src/gn/starlark/vendor/cxx/include -I. -isystemTOPDIR/tmp/work/x86_64-linux/gn-native/0+git/recipe-sysroot-native/usr/include -O2 -pipe -Wno-error=maybe-uninitialized -isystemTOPDIR/tmp/work/x86_64-linux/gn-native/0+git/recipe-sysroot-native/usr/include -O2 -pipe -fvisibility-inlines-hidden -DNDEBUG -O3 -g -fdata-sections -ffunction-sections -D_FILE_OFFSET_BITS=64 -D__STDC_CONSTANT_MACROS -D__STDC_FORMAT_MACROS -pthread -pipe -fno-exceptions -fno-rtti -fdiagnostics-color -Wall -Wextra -Wno-unused-parameter -Wextra-semi -Wundef -std=c++23 -Wno-redundant-move -Wno-restrict -Wno-deprecated-copy -Wno-implicit-fallthrough -Wno-redundant-move -Wno-unused-variable -Wno-format -Wno-strict-aliasing -Wno-cast-function-type -c ../sources/gn-0+git/src/gn/config_values_extractors.cc -o src/gn/config_values_extractors.o
In file included from ../sources/gn-0+git/src/gn/scope.h:19,
from ../sources/gn-0+git/src/gn/args.h:15,
from ../sources/gn-0+git/src/gn/build_settings.h:15,
from ../sources/gn-0+git/src/gn/metadata.h:10,
from ../sources/gn-0+git/src/gn/target.h:22,
from ../sources/gn-0+git/src/gn/config_values_extractors.h:16,
from ../sources/gn-0+git/src/gn/config_values_extractors.cc:5:
../sources/gn-0+git/src/gn/err.h:8:10: fatal error: expected: No such file or directory
8 | #include <expected>
| ^~~~~~~~~~
compilation terminated.
[46/216] g++ -MMD -MF src/gn/config_values_generator.o.d -I../sources/gn-0+git/src -I../sources/gn-0+git/src/gn/starlark/vendor/cxx/include -I. -isystemTOPDIR/tmp/work/x86_64-linux/gn-native/0+git/recipe-sysroot-native/usr/include -O2 -pipe -Wno-error=maybe-uninitialized -isystemTOPDIR/tmp/work/x86_64-linux/gn-native/0+git/recipe-sysroot-native/usr/include -O2 -pipe -fvisibility-inlines-hidden -DNDEBUG -O3 -g -fdata-sections -ffunction-sections -D_FILE_OFFSET_BITS=64 -D__STDC_CONSTANT_MACROS -D__STDC_FORMAT_MACROS -pthread -pipe -fno-exceptions -fno-rtti -fdiagnostics-color -Wall -Wextra -Wno-unused-parameter -Wextra-semi -Wundef -std=c++23 -Wno-redundant-move -Wno-restrict -Wno-deprecated-copy -Wno-implicit-fallthrough -Wno-redundant-move -Wno-unused-variable -Wno-format -Wno-strict-aliasing -Wno-cast-function-type -c ../sources/gn-0+git/src/gn/config_values_generator.cc -o src/gn/config_values_generator.o
FAILED: [code=1] src/gn/config_values_generator.o
g++ -MMD -MF src/gn/config_values_generator.o.d -I../sources/gn-0+git/src -I../sources/gn-0+git/src/gn/starlark/vendor/cxx/include -I. -isystemTOPDIR/tmp/work/x86_64-linux/gn-native/0+git/recipe-sysroot-native/usr/include -O2 -pipe -Wno-error=maybe-uninitialized -isystemTOPDIR/tmp/work/x86_64-linux/gn-native/0+git/recipe-sysroot-native/usr/include -O2 -pipe -fvisibility-inlines-hidden -DNDEBUG -O3 -g -fdata-sections -ffunction-sections -D_FILE_OFFSET_BITS=64 -D__STDC_CONSTANT_MACROS -D__STDC_FORMAT_MACROS -pthread -pipe -fno-exceptions -fno-rtti -fdiagnostics-color -Wall -Wextra -Wno-unused-parameter -Wextra-semi -Wundef -std=c++23 -Wno-redundant-move -Wno-restrict -Wno-deprecated-copy -Wno-implicit-fallthrough -Wno-redundant-move -Wno-unused-variable -Wno-format -Wno-strict-aliasing -Wno-cast-function-type -c ../sources/gn-0+git/src/gn/config_values_generator.cc -o src/gn/config_values_generator.o
In file included from ../sources/gn-0+git/src/gn/scope.h:19,
from ../sources/gn-0+git/src/gn/args.h:15,
from ../sources/gn-0+git/src/gn/build_settings.h:15,
from ../sources/gn-0+git/src/gn/config_values_generator.cc:8:
../sources/gn-0+git/src/gn/err.h:8:10: fatal error: expected: No such file or directory
8 | #include <expected>
| ^~~~~~~~~~
compilation terminated.
[47/216] g++ -MMD -MF src/gn/copy_target_generator.o.d -I../sources/gn-0+git/src -I../sources/gn-0+git/src/gn/starlark/vendor/cxx/include -I. -isystemTOPDIR/tmp/work/x86_64-linux/gn-native/0+git/recipe-sysroot-native/usr/include -O2 -pipe -Wno-error=maybe-uninitialized -isystemTOPDIR/tmp/work/x86_64-linux/gn-native/0+git/recipe-sysroot-native/usr/include -O2 -pipe -fvisibility-inlines-hidden -DNDEBUG -O3 -g -fdata-sections -ffunction-sections -D_FILE_OFFSET_BITS=64 -D__STDC_CONSTANT_MACROS -D__STDC_FORMAT_MACROS -pthread -pipe -fno-exceptions -fno-rtti -fdiagnostics-color -Wall -Wextra -Wno-unused-parameter -Wextra-semi -Wundef -std=c++23 -Wno-redundant-move -Wno-restrict -Wno-deprecated-copy -Wno-implicit-fallthrough -Wno-redundant-move -Wno-unused-variable -Wno-format -Wno-strict-aliasing -Wno-cast-function-type -c ../sources/gn-0+git/src/gn/copy_target_generator.cc -o src/gn/copy_target_generator.o
FAILED: [code=1] src/gn/copy_target_generator.o
g++ -MMD -MF src/gn/copy_target_generator.o.d -I../sources/gn-0+git/src -I../sources/gn-0+git/src/gn/starlark/vendor/cxx/include -I. -isystemTOPDIR/tmp/work/x86_64-linux/gn-native/0+git/recipe-sysroot-native/usr/include -O2 -pipe -Wno-error=maybe-uninitialized -isystemTOPDIR/tmp/work/x86_64-linux/gn-native/0+git/recipe-sysroot-native/usr/include -O2 -pipe -fvisibility-inlines-hidden -DNDEBUG -O3 -g -fdata-sections -ffunction-sections -D_FILE_OFFSET_BITS=64 -D__STDC_CONSTANT_MACROS -D__STDC_FORMAT_MACROS -pthread -pipe -fno-exceptions -fno-rtti -fdiagnostics-color -Wall -Wextra -Wno-unused-parameter -Wextra-semi -Wundef -std=c++23 -Wno-redundant-move -Wno-restrict -Wno-deprecated-copy -Wno-implicit-fallthrough -Wno-redundant-move -Wno-unused-variable -Wno-format -Wno-strict-aliasing -Wno-cast-function-type -c ../sources/gn-0+git/src/gn/copy_target_generator.cc -o src/gn/copy_target_generator.o
In file included from ../sources/gn-0+git/src/gn/scope.h:19,
from ../sources/gn-0+git/src/gn/args.h:15,
from ../sources/gn-0+git/src/gn/build_settings.h:15,
from ../sources/gn-0+git/src/gn/copy_target_generator.cc:7:
../sources/gn-0+git/src/gn/err.h:8:10: fatal error: expected: No such file or directory
8 | #include <expected>
| ^~~~~~~~~~
compilation terminated.
[48/216] g++ -MMD -MF src/gn/desc_builder.o.d -I../sources/gn-0+git/src -I../sources/gn-0+git/src/gn/starlark/vendor/cxx/include -I. -isystemTOPDIR/tmp/work/x86_64-linux/gn-native/0+git/recipe-sysroot-native/usr/include -O2 -pipe -Wno-error=maybe-uninitialized -isystemTOPDIR/tmp/work/x86_64-linux/gn-native/0+git/recipe-sysroot-native/usr/include -O2 -pipe -fvisibility-inlines-hidden -DNDEBUG -O3 -g -fdata-sections -ffunction-sections -D_FILE_OFFSET_BITS=64 -D__STDC_CONSTANT_MACROS -D__STDC_FORMAT_MACROS -pthread -pipe -fno-exceptions -fno-rtti -fdiagnostics-color -Wall -Wextra -Wno-unused-parameter -Wextra-semi -Wundef -std=c++23 -Wno-redundant-move -Wno-restrict -Wno-deprecated-copy -Wno-implicit-fallthrough -Wno-redundant-move -Wno-unused-variable -Wno-format -Wno-strict-aliasing -Wno-cast-function-type -c ../sources/gn-0+git/src/gn/desc_builder.cc -o src/gn/desc_builder.o
FAILED: [code=1] src/gn/desc_builder.o
g++ -MMD -MF src/gn/desc_builder.o.d -I../sources/gn-0+git/src -I../sources/gn-0+git/src/gn/starlark/vendor/cxx/include -I. -isystemTOPDIR/tmp/work/x86_64-linux/gn-native/0+git/recipe-sysroot-native/usr/include -O2 -pipe -Wno-error=maybe-uninitialized -isystemTOPDIR/tmp/work/x86_64-linux/gn-native/0+git/recipe-sysroot-native/usr/include -O2 -pipe -fvisibility-inlines-hidden -DNDEBUG -O3 -g -fdata-sections -ffunction-sections -D_FILE_OFFSET_BITS=64 -D__STDC_CONSTANT_MACROS -D__STDC_FORMAT_MACROS -pthread -pipe -fno-exceptions -fno-rtti -fdiagnostics-color -Wall -Wextra -Wno-unused-parameter -Wextra-semi -Wundef -std=c++23 -Wno-redundant-move -Wno-restrict -Wno-deprecated-copy -Wno-implicit-fallthrough -Wno-redundant-move -Wno-unused-variable -Wno-format -Wno-strict-aliasing -Wno-cast-function-type -c ../sources/gn-0+git/src/gn/desc_builder.cc -o src/gn/desc_builder.o
In file included from ../sources/gn-0+git/src/gn/header_checker.h:24,
from ../sources/gn-0+git/src/gn/commands.h:20,
from ../sources/gn-0+git/src/gn/desc_builder.cc:10:
../sources/gn-0+git/src/gn/err.h:8:10: fatal error: expected: No such file or directory
8 | #include <expected>
| ^~~~~~~~~~
compilation terminated.
[49/216] g++ -MMD -MF src/gn/eclipse_writer.o.d -I../sources/gn-0+git/src -I../sources/gn-0+git/src/gn/starlark/vendor/cxx/include -I. -isystemTOPDIR/tmp/work/x86_64-linux/gn-native/0+git/recipe-sysroot-native/usr/include -O2 -pipe -Wno-error=maybe-uninitialized -isystemTOPDIR/tmp/work/x86_64-linux/gn-native/0+git/recipe-sysroot-native/usr/include -O2 -pipe -fvisibility-inlines-hidden -DNDEBUG -O3 -g -fdata-sections -ffunction-sections -D_FILE_OFFSET_BITS=64 -D__STDC_CONSTANT_MACROS -D__STDC_FORMAT_MACROS -pthread -pipe -fno-exceptions -fno-rtti -fdiagnostics-color -Wall -Wextra -Wno-unused-parameter -Wextra-semi -Wundef -std=c++23 -Wno-redundant-move -Wno-restrict -Wno-deprecated-copy -Wno-implicit-fallthrough -Wno-redundant-move -Wno-unused-variable -Wno-format -Wno-strict-aliasing -Wno-cast-function-type -c ../sources/gn-0+git/src/gn/eclipse_writer.cc -o src/gn/eclipse_writer.o
FAILED: [code=1] src/gn/eclipse_writer.o
g++ -MMD -MF src/gn/eclipse_writer.o.d -I../sources/gn-0+git/src -I../sources/gn-0+git/src/gn/starlark/vendor/cxx/include -I. -isystemTOPDIR/tmp/work/x86_64-linux/gn-native/0+git/recipe-sysroot-native/usr/include -O2 -pipe -Wno-error=maybe-uninitialized -isystemTOPDIR/tmp/work/x86_64-linux/gn-native/0+git/recipe-sysroot-native/usr/include -O2 -pipe -fvisibility-inlines-hidden -DNDEBUG -O3 -g -fdata-sections -ffunction-sections -D_FILE_OFFSET_BITS=64 -D__STDC_CONSTANT_MACROS -D__STDC_FORMAT_MACROS -pthread -pipe -fno-exceptions -fno-rtti -fdiagnostics-color -Wall -Wextra -Wno-unused-parameter -Wextra-semi -Wundef -std=c++23 -Wno-redundant-move -Wno-restrict -Wno-deprecated-copy -Wno-implicit-fallthrough -Wno-redundant-move -Wno-unused-variable -Wno-format -Wno-strict-aliasing -Wno-cast-function-type -c ../sources/gn-0+git/src/gn/eclipse_writer.cc -o src/gn/eclipse_writer.o
In file included from ../sources/gn-0+git/src/gn/scope.h:19,
from ../sources/gn-0+git/src/gn/args.h:15,
from ../sources/gn-0+git/src/gn/build_settings.h:15,
from ../sources/gn-0+git/src/gn/metadata.h:10,
from ../sources/gn-0+git/src/gn/target.h:22,
from ../sources/gn-0+git/src/gn/config_values_extractors.h:16,
from ../sources/gn-0+git/src/gn/eclipse_writer.cc:12:
../sources/gn-0+git/src/gn/err.h:8:10: fatal error: expected: No such file or directory
8 | #include <expected>
| ^~~~~~~~~~
compilation terminated.
[50/216] g++ -MMD -MF src/gn/edit_subcommands.o.d -I../sources/gn-0+git/src -I../sources/gn-0+git/src/gn/starlark/vendor/cxx/include -I. -isystemTOPDIR/tmp/work/x86_64-linux/gn-native/0+git/recipe-sysroot-native/usr/include -O2 -pipe -Wno-error=maybe-uninitialized -isystemTOPDIR/tmp/work/x86_64-linux/gn-native/0+git/recipe-sysroot-native/usr/include -O2 -pipe -fvisibility-inlines-hidden -DNDEBUG -O3 -g -fdata-sections -ffunction-sections -D_FILE_OFFSET_BITS=64 -D__STDC_CONSTANT_MACROS -D__STDC_FORMAT_MACROS -pthread -pipe -fno-exceptions -fno-rtti -fdiagnostics-color -Wall -Wextra -Wno-unused-parameter -Wextra-semi -Wundef -std=c++23 -Wno-redundant-move -Wno-restrict -Wno-deprecated-copy -Wno-implicit-fallthrough -Wno-redundant-move -Wno-unused-variable -Wno-format -Wno-strict-aliasing -Wno-cast-function-type -c ../sources/gn-0+git/src/gn/edit_subcommands.cc -o src/gn/edit_subcommands.o
FAILED: [code=1] src/gn/edit_subcommands.o
g++ -MMD -MF src/gn/edit_subcommands.o.d -I../sources/gn-0+git/src -I../sources/gn-0+git/src/gn/starlark/vendor/cxx/include -I. -isystemTOPDIR/tmp/work/x86_64-linux/gn-native/0+git/recipe-sysroot-native/usr/include -O2 -pipe -Wno-error=maybe-uninitialized -isystemTOPDIR/tmp/work/x86_64-linux/gn-native/0+git/recipe-sysroot-native/usr/include -O2 -pipe -fvisibility-inlines-hidden -DNDEBUG -O3 -g -fdata-sections -ffunction-sections -D_FILE_OFFSET_BITS=64 -D__STDC_CONSTANT_MACROS -D__STDC_FORMAT_MACROS -pthread -pipe -fno-exceptions -fno-rtti -fdiagnostics-color -Wall -Wextra -Wno-unused-parameter -Wextra-semi -Wundef -std=c++23 -Wno-redundant-move -Wno-restrict -Wno-deprecated-copy -Wno-implicit-fallthrough -Wno-redundant-move -Wno-unused-variable -Wno-format -Wno-strict-aliasing -Wno-cast-function-type -c ../sources/gn-0+git/src/gn/edit_subcommands.cc -o src/gn/edit_subcommands.o
In file included from ../sources/gn-0+git/src/gn/edit_subcommands.h:13,
from ../sources/gn-0+git/src/gn/edit_subcommands.cc:5:
../sources/gn-0+git/src/gn/err.h:8:10: fatal error: expected: No such file or directory
8 | #include <expected>
| ^~~~~~~~~~
compilation terminated.
[51/216] g++ -MMD -MF src/gn/err.o.d -I../sources/gn-0+git/src -I../sources/gn-0+git/src/gn/starlark/vendor/cxx/include -I. -isystemTOPDIR/tmp/work/x86_64-linux/gn-native/0+git/recipe-sysroot-native/usr/include -O2 -pipe -Wno-error=maybe-uninitialized -isystemTOPDIR/tmp/work/x86_64-linux/gn-native/0+git/recipe-sysroot-native/usr/include -O2 -pipe -fvisibility-inlines-hidden -DNDEBUG -O3 -g -fdata-sections -ffunction-sections -D_FILE_OFFSET_BITS=64 -D__STDC_CONSTANT_MACROS -D__STDC_FORMAT_MACROS -pthread -pipe -fno-exceptions -fno-rtti -fdiagnostics-color -Wall -Wextra -Wno-unused-parameter -Wextra-semi -Wundef -std=c++23 -Wno-redundant-move -Wno-restrict -Wno-deprecated-copy -Wno-implicit-fallthrough -Wno-redundant-move -Wno-unused-variable -Wno-format -Wno-strict-aliasing -Wno-cast-function-type -c ../sources/gn-0+git/src/gn/err.cc -o src/gn/err.o
FAILED: [code=1] src/gn/err.o
g++ -MMD -MF src/gn/err.o.d -I../sources/gn-0+git/src -I../sources/gn-0+git/src/gn/starlark/vendor/cxx/include -I. -isystemTOPDIR/tmp/work/x86_64-linux/gn-native/0+git/recipe-sysroot-native/usr/include -O2 -pipe -Wno-error=maybe-uninitialized -isystemTOPDIR/tmp/work/x86_64-linux/gn-native/0+git/recipe-sysroot-native/usr/include -O2 -pipe -fvisibility-inlines-hidden -DNDEBUG -O3 -g -fdata-sections -ffunction-sections -D_FILE_OFFSET_BITS=64 -D__STDC_CONSTANT_MACROS -D__STDC_FORMAT_MACROS -pthread -pipe -fno-exceptions -fno-rtti -fdiagnostics-color -Wall -Wextra -Wno-unused-parameter -Wextra-semi -Wundef -std=c++23 -Wno-redundant-move -Wno-restrict -Wno-deprecated-copy -Wno-implicit-fallthrough -Wno-redundant-move -Wno-unused-variable -Wno-format -Wno-strict-aliasing -Wno-cast-function-type -c ../sources/gn-0+git/src/gn/err.cc -o src/gn/err.o
In file included from ../sources/gn-0+git/src/gn/err.cc:5:
../sources/gn-0+git/src/gn/err.h:8:10: fatal error: expected: No such file or directory
8 | #include <expected>
| ^~~~~~~~~~
compilation terminated.
[52/216] g++ -MMD -MF src/gn/ffi/bridge.o.d -I../sources/gn-0+git/src -I../sources/gn-0+git/src/gn/starlark/vendor/cxx/include -I. -isystemTOPDIR/tmp/work/x86_64-linux/gn-native/0+git/recipe-sysroot-native/usr/include -O2 -pipe -Wno-error=maybe-uninitialized -isystemTOPDIR/tmp/work/x86_64-linux/gn-native/0+git/recipe-sysroot-native/usr/include -O2 -pipe -fvisibility-inlines-hidden -DNDEBUG -O3 -g -fdata-sections -ffunction-sections -D_FILE_OFFSET_BITS=64 -D__STDC_CONSTANT_MACROS -D__STDC_FORMAT_MACROS -pthread -pipe -fno-exceptions -fno-rtti -fdiagnostics-color -Wall -Wextra -Wno-unused-parameter -Wextra-semi -Wundef -std=c++23 -Wno-redundant-move -Wno-restrict -Wno-deprecated-copy -Wno-implicit-fallthrough -Wno-redundant-move -Wno-unused-variable -Wno-format -Wno-strict-aliasing -Wno-cast-function-type -c ../sources/gn-0+git/src/gn/ffi/bridge.cc -o src/gn/ffi/bridge.o
FAILED: [code=1] src/gn/ffi/bridge.o
g++ -MMD -MF src/gn/ffi/bridge.o.d -I../sources/gn-0+git/src -I../sources/gn-0+git/src/gn/starlark/vendor/cxx/include -I. -isystemTOPDIR/tmp/work/x86_64-linux/gn-native/0+git/recipe-sysroot-native/usr/include -O2 -pipe -Wno-error=maybe-uninitialized -isystemTOPDIR/tmp/work/x86_64-linux/gn-native/0+git/recipe-sysroot-native/usr/include -O2 -pipe -fvisibility-inlines-hidden -DNDEBUG -O3 -g -fdata-sections -ffunction-sections -D_FILE_OFFSET_BITS=64 -D__STDC_CONSTANT_MACROS -D__STDC_FORMAT_MACROS -pthread -pipe -fno-exceptions -fno-rtti -fdiagnostics-color -Wall -Wextra -Wno-unused-parameter -Wextra-semi -Wundef -std=c++23 -Wno-redundant-move -Wno-restrict -Wno-deprecated-copy -Wno-implicit-fallthrough -Wno-redundant-move -Wno-unused-variable -Wno-format -Wno-strict-aliasing -Wno-cast-function-type -c ../sources/gn-0+git/src/gn/ffi/bridge.cc -o src/gn/ffi/bridge.o
In file included from ../sources/gn-0+git/src/gn/ffi/bridge.cc:3:
../sources/gn-0+git/src/gn/err.h:8:10: fatal error: expected: No such file or directory
8 | #include <expected>
| ^~~~~~~~~~
compilation terminated.
[53/216] g++ -MMD -MF src/gn/function_filter.o.d -I../sources/gn-0+git/src -I../sources/gn-0+git/src/gn/starlark/vendor/cxx/include -I. -isystemTOPDIR/tmp/work/x86_64-linux/gn-native/0+git/recipe-sysroot-native/usr/include -O2 -pipe -Wno-error=maybe-uninitialized -isystemTOPDIR/tmp/work/x86_64-linux/gn-native/0+git/recipe-sysroot-native/usr/include -O2 -pipe -fvisibility-inlines-hidden -DNDEBUG -O3 -g -fdata-sections -ffunction-sections -D_FILE_OFFSET_BITS=64 -D__STDC_CONSTANT_MACROS -D__STDC_FORMAT_MACROS -pthread -pipe -fno-exceptions -fno-rtti -fdiagnostics-color -Wall -Wextra -Wno-unused-parameter -Wextra-semi -Wundef -std=c++23 -Wno-redundant-move -Wno-restrict -Wno-deprecated-copy -Wno-implicit-fallthrough -Wno-redundant-move -Wno-unused-variable -Wno-format -Wno-strict-aliasing -Wno-cast-function-type -c ../sources/gn-0+git/src/gn/function_filter.cc -o src/gn/function_filter.o
FAILED: [code=1] src/gn/function_filter.o
g++ -MMD -MF src/gn/function_filter.o.d -I../sources/gn-0+git/src -I../sources/gn-0+git/src/gn/starlark/vendor/cxx/include -I. -isystemTOPDIR/tmp/work/x86_64-linux/gn-native/0+git/recipe-sysroot-native/usr/include -O2 -pipe -Wno-error=maybe-uninitialized -isystemTOPDIR/tmp/work/x86_64-linux/gn-native/0+git/recipe-sysroot-native/usr/include -O2 -pipe -fvisibility-inlines-hidden -DNDEBUG -O3 -g -fdata-sections -ffunction-sections -D_FILE_OFFSET_BITS=64 -D__STDC_CONSTANT_MACROS -D__STDC_FORMAT_MACROS -pthread -pipe -fno-exceptions -fno-rtti -fdiagnostics-color -Wall -Wextra -Wno-unused-parameter -Wextra-semi -Wundef -std=c++23 -Wno-redundant-move -Wno-restrict -Wno-deprecated-copy -Wno-implicit-fallthrough -Wno-redundant-move -Wno-unused-variable -Wno-format -Wno-strict-aliasing -Wno-cast-function-type -c ../sources/gn-0+git/src/gn/function_filter.cc -o src/gn/function_filter.o
In file included from ../sources/gn-0+git/src/gn/function_filter.cc:7:
../sources/gn-0+git/src/gn/err.h:8:10: fatal error: expected: No such file or directory
8 | #include <expected>
| ^~~~~~~~~~
compilation terminated.
[54/216] g++ -MMD -MF src/gn/command_outputs.o.d -I../sources/gn-0+git/src -I../sources/gn-0+git/src/gn/starlark/vendor/cxx/include -I. -isystemTOPDIR/tmp/work/x86_64-linux/gn-native/0+git/recipe-sysroot-native/usr/include -O2 -pipe -Wno-error=maybe-uninitialized -isystemTOPDIR/tmp/work/x86_64-linux/gn-native/0+git/recipe-sysroot-native/usr/include -O2 -pipe -fvisibility-inlines-hidden -DNDEBUG -O3 -g -fdata-sections -ffunction-sections -D_FILE_OFFSET_BITS=64 -D__STDC_CONSTANT_MACROS -D__STDC_FORMAT_MACROS -pthread -pipe -fno-exceptions -fno-rtti -fdiagnostics-color -Wall -Wextra -Wno-unused-parameter -Wextra-semi -Wundef -std=c++23 -Wno-redundant-move -Wno-restrict -Wno-deprecated-copy -Wno-implicit-fallthrough -Wno-redundant-move -Wno-unused-variable -Wno-format -Wno-strict-aliasing -Wno-cast-function-type -c ../sources/gn-0+git/src/gn/command_outputs.cc -o src/gn/command_outputs.o
FAILED: [code=1] src/gn/command_outputs.o
g++ -MMD -MF src/gn/command_outputs.o.d -I../sources/gn-0+git/src -I../sources/gn-0+git/src/gn/starlark/vendor/cxx/include -I. -isystemTOPDIR/tmp/work/x86_64-linux/gn-native/0+git/recipe-sysroot-native/usr/include -O2 -pipe -Wno-error=maybe-uninitialized -isystemTOPDIR/tmp/work/x86_64-linux/gn-native/0+git/recipe-sysroot-native/usr/include -O2 -pipe -fvisibility-inlines-hidden -DNDEBUG -O3 -g -fdata-sections -ffunction-sections -D_FILE_OFFSET_BITS=64 -D__STDC_CONSTANT_MACROS -D__STDC_FORMAT_MACROS -pthread -pipe -fno-exceptions -fno-rtti -fdiagnostics-color -Wall -Wextra -Wno-unused-parameter -Wextra-semi -Wundef -std=c++23 -Wno-redundant-move -Wno-restrict -Wno-deprecated-copy -Wno-implicit-fallthrough -Wno-redundant-move -Wno-unused-variable -Wno-format -Wno-strict-aliasing -Wno-cast-function-type -c ../sources/gn-0+git/src/gn/command_outputs.cc -o src/gn/command_outputs.o
In file included from ../sources/gn-0+git/src/gn/header_checker.h:24,
from ../sources/gn-0+git/src/gn/commands.h:20,
from ../sources/gn-0+git/src/gn/command_outputs.cc:11:
../sources/gn-0+git/src/gn/err.h:8:10: fatal error: expected: No such file or directory
8 | #include <expected>
| ^~~~~~~~~~
compilation terminated.
[55/216] g++ -MMD -MF src/gn/command_refs.o.d -I../sources/gn-0+git/src -I../sources/gn-0+git/src/gn/starlark/vendor/cxx/include -I. -isystemTOPDIR/tmp/work/x86_64-linux/gn-native/0+git/recipe-sysroot-native/usr/include -O2 -pipe -Wno-error=maybe-uninitialized -isystemTOPDIR/tmp/work/x86_64-linux/gn-native/0+git/recipe-sysroot-native/usr/include -O2 -pipe -fvisibility-inlines-hidden -DNDEBUG -O3 -g -fdata-sections -ffunction-sections -D_FILE_OFFSET_BITS=64 -D__STDC_CONSTANT_MACROS -D__STDC_FORMAT_MACROS -pthread -pipe -fno-exceptions -fno-rtti -fdiagnostics-color -Wall -Wextra -Wno-unused-parameter -Wextra-semi -Wundef -std=c++23 -Wno-redundant-move -Wno-restrict -Wno-deprecated-copy -Wno-implicit-fallthrough -Wno-redundant-move -Wno-unused-variable -Wno-format -Wno-strict-aliasing -Wno-cast-function-type -c ../sources/gn-0+git/src/gn/command_refs.cc -o src/gn/command_refs.o
FAILED: [code=1] src/gn/command_refs.o
g++ -MMD -MF src/gn/command_refs.o.d -I../sources/gn-0+git/src -I../sources/gn-0+git/src/gn/starlark/vendor/cxx/include -I. -isystemTOPDIR/tmp/work/x86_64-linux/gn-native/0+git/recipe-sysroot-native/usr/include -O2 -pipe -Wno-error=maybe-uninitialized -isystemTOPDIR/tmp/work/x86_64-linux/gn-native/0+git/recipe-sysroot-native/usr/include -O2 -pipe -fvisibility-inlines-hidden -DNDEBUG -O3 -g -fdata-sections -ffunction-sections -D_FILE_OFFSET_BITS=64 -D__STDC_CONSTANT_MACROS -D__STDC_FORMAT_MACROS -pthread -pipe -fno-exceptions -fno-rtti -fdiagnostics-color -Wall -Wextra -Wno-unused-parameter -Wextra-semi -Wundef -std=c++23 -Wno-redundant-move -Wno-restrict -Wno-deprecated-copy -Wno-implicit-fallthrough -Wno-redundant-move -Wno-unused-variable -Wno-format -Wno-strict-aliasing -Wno-cast-function-type -c ../sources/gn-0+git/src/gn/command_refs.cc -o src/gn/command_refs.o
In file included from ../sources/gn-0+git/src/gn/header_checker.h:24,
from ../sources/gn-0+git/src/gn/commands.h:20,
from ../sources/gn-0+git/src/gn/command_refs.cc:14:
../sources/gn-0+git/src/gn/err.h:8:10: fatal error: expected: No such file or directory
8 | #include <expected>
| ^~~~~~~~~~
compilation terminated.
[56/216] g++ -MMD -MF src/gn/create_bundle_target_generator.o.d -I../sources/gn-0+git/src -I../sources/gn-0+git/src/gn/starlark/vendor/cxx/include -I. -isystemTOPDIR/tmp/work/x86_64-linux/gn-native/0+git/recipe-sysroot-native/usr/include -O2 -pipe -Wno-error=maybe-uninitialized -isystemTOPDIR/tmp/work/x86_64-linux/gn-native/0+git/recipe-sysroot-native/usr/include -O2 -pipe -fvisibility-inlines-hidden -DNDEBUG -O3 -g -fdata-sections -ffunction-sections -D_FILE_OFFSET_BITS=64 -D__STDC_CONSTANT_MACROS -D__STDC_FORMAT_MACROS -pthread -pipe -fno-exceptions -fno-rtti -fdiagnostics-color -Wall -Wextra -Wno-unused-parameter -Wextra-semi -Wundef -std=c++23 -Wno-redundant-move -Wno-restrict -Wno-deprecated-copy -Wno-implicit-fallthrough -Wno-redundant-move -Wno-unused-variable -Wno-format -Wno-strict-aliasing -Wno-cast-function-type -c ../sources/gn-0+git/src/gn/create_bundle_target_generator.cc -o src/gn/create_bundle_target_generator.o
FAILED: [code=1] src/gn/create_bundle_target_generator.o
g++ -MMD -MF src/gn/create_bundle_target_generator.o.d -I../sources/gn-0+git/src -I../sources/gn-0+git/src/gn/starlark/vendor/cxx/include -I. -isystemTOPDIR/tmp/work/x86_64-linux/gn-native/0+git/recipe-sysroot-native/usr/include -O2 -pipe -Wno-error=maybe-uninitialized -isystemTOPDIR/tmp/work/x86_64-linux/gn-native/0+git/recipe-sysroot-native/usr/include -O2 -pipe -fvisibility-inlines-hidden -DNDEBUG -O3 -g -fdata-sections -ffunction-sections -D_FILE_OFFSET_BITS=64 -D__STDC_CONSTANT_MACROS -D__STDC_FORMAT_MACROS -pthread -pipe -fno-exceptions -fno-rtti -fdiagnostics-color -Wall -Wextra -Wno-unused-parameter -Wextra-semi -Wundef -std=c++23 -Wno-redundant-move -Wno-restrict -Wno-deprecated-copy -Wno-implicit-fallthrough -Wno-redundant-move -Wno-unused-variable -Wno-format -Wno-strict-aliasing -Wno-cast-function-type -c ../sources/gn-0+git/src/gn/create_bundle_target_generator.cc -o src/gn/create_bundle_target_generator.o
In file included from ../sources/gn-0+git/src/gn/scope.h:19,
from ../sources/gn-0+git/src/gn/settings.h:11,
from ../sources/gn-0+git/src/gn/filesystem_utils.h:14,
from ../sources/gn-0+git/src/gn/create_bundle_target_generator.cc:11:
../sources/gn-0+git/src/gn/err.h:8:10: fatal error: expected: No such file or directory
8 | #include <expected>
| ^~~~~~~~~~
compilation terminated.
[57/216] g++ -MMD -MF src/gn/deps_iterator.o.d -I../sources/gn-0+git/src -I../sources/gn-0+git/src/gn/starlark/vendor/cxx/include -I. -isystemTOPDIR/tmp/work/x86_64-linux/gn-native/0+git/recipe-sysroot-native/usr/include -O2 -pipe -Wno-error=maybe-uninitialized -isystemTOPDIR/tmp/work/x86_64-linux/gn-native/0+git/recipe-sysroot-native/usr/include -O2 -pipe -fvisibility-inlines-hidden -DNDEBUG -O3 -g -fdata-sections -ffunction-sections -D_FILE_OFFSET_BITS=64 -D__STDC_CONSTANT_MACROS -D__STDC_FORMAT_MACROS -pthread -pipe -fno-exceptions -fno-rtti -fdiagnostics-color -Wall -Wextra -Wno-unused-parameter -Wextra-semi -Wundef -std=c++23 -Wno-redundant-move -Wno-restrict -Wno-deprecated-copy -Wno-implicit-fallthrough -Wno-redundant-move -Wno-unused-variable -Wno-format -Wno-strict-aliasing -Wno-cast-function-type -c ../sources/gn-0+git/src/gn/deps_iterator.cc -o src/gn/deps_iterator.o
FAILED: [code=1] src/gn/deps_iterator.o
g++ -MMD -MF src/gn/deps_iterator.o.d -I../sources/gn-0+git/src -I../sources/gn-0+git/src/gn/starlark/vendor/cxx/include -I. -isystemTOPDIR/tmp/work/x86_64-linux/gn-native/0+git/recipe-sysroot-native/usr/include -O2 -pipe -Wno-error=maybe-uninitialized -isystemTOPDIR/tmp/work/x86_64-linux/gn-native/0+git/recipe-sysroot-native/usr/include -O2 -pipe -fvisibility-inlines-hidden -DNDEBUG -O3 -g -fdata-sections -ffunction-sections -D_FILE_OFFSET_BITS=64 -D__STDC_CONSTANT_MACROS -D__STDC_FORMAT_MACROS -pthread -pipe -fno-exceptions -fno-rtti -fdiagnostics-color -Wall -Wextra -Wno-unused-parameter -Wextra-semi -Wundef -std=c++23 -Wno-redundant-move -Wno-restrict -Wno-deprecated-copy -Wno-implicit-fallthrough -Wno-redundant-move -Wno-unused-variable -Wno-format -Wno-strict-aliasing -Wno-cast-function-type -c ../sources/gn-0+git/src/gn/deps_iterator.cc -o src/gn/deps_iterator.o
In file included from ../sources/gn-0+git/src/gn/scope.h:19,
from ../sources/gn-0+git/src/gn/args.h:15,
from ../sources/gn-0+git/src/gn/build_settings.h:15,
from ../sources/gn-0+git/src/gn/metadata.h:10,
from ../sources/gn-0+git/src/gn/target.h:22,
from ../sources/gn-0+git/src/gn/deps_iterator.cc:7:
../sources/gn-0+git/src/gn/err.h:8:10: fatal error: expected: No such file or directory
8 | #include <expected>
| ^~~~~~~~~~
compilation terminated.
[58/216] g++ -MMD -MF src/gn/edit_command.o.d -I../sources/gn-0+git/src -I../sources/gn-0+git/src/gn/starlark/vendor/cxx/include -I. -isystemTOPDIR/tmp/work/x86_64-linux/gn-native/0+git/recipe-sysroot-native/usr/include -O2 -pipe -Wno-error=maybe-uninitialized -isystemTOPDIR/tmp/work/x86_64-linux/gn-native/0+git/recipe-sysroot-native/usr/include -O2 -pipe -fvisibility-inlines-hidden -DNDEBUG -O3 -g -fdata-sections -ffunction-sections -D_FILE_OFFSET_BITS=64 -D__STDC_CONSTANT_MACROS -D__STDC_FORMAT_MACROS -pthread -pipe -fno-exceptions -fno-rtti -fdiagnostics-color -Wall -Wextra -Wno-unused-parameter -Wextra-semi -Wundef -std=c++23 -Wno-redundant-move -Wno-restrict -Wno-deprecated-copy -Wno-implicit-fallthrough -Wno-redundant-move -Wno-unused-variable -Wno-format -Wno-strict-aliasing -Wno-cast-function-type -c ../sources/gn-0+git/src/gn/edit_command.cc -o src/gn/edit_command.o
FAILED: [code=1] src/gn/edit_command.o
g++ -MMD -MF src/gn/edit_command.o.d -I../sources/gn-0+git/src -I../sources/gn-0+git/src/gn/starlark/vendor/cxx/include -I. -isystemTOPDIR/tmp/work/x86_64-linux/gn-native/0+git/recipe-sysroot-native/usr/include -O2 -pipe -Wno-error=maybe-uninitialized -isystemTOPDIR/tmp/work/x86_64-linux/gn-native/0+git/recipe-sysroot-native/usr/include -O2 -pipe -fvisibility-inlines-hidden -DNDEBUG -O3 -g -fdata-sections -ffunction-sections -D_FILE_OFFSET_BITS=64 -D__STDC_CONSTANT_MACROS -D__STDC_FORMAT_MACROS -pthread -pipe -fno-exceptions -fno-rtti -fdiagnostics-color -Wall -Wextra -Wno-unused-parameter -Wextra-semi -Wundef -std=c++23 -Wno-redundant-move -Wno-restrict -Wno-deprecated-copy -Wno-implicit-fallthrough -Wno-redundant-move -Wno-unused-variable -Wno-format -Wno-strict-aliasing -Wno-cast-function-type -c ../sources/gn-0+git/src/gn/edit_command.cc -o src/gn/edit_command.o
In file included from ../sources/gn-0+git/src/gn/edit_subcommands.h:13,
from ../sources/gn-0+git/src/gn/edit_command.h:11,
from ../sources/gn-0+git/src/gn/edit_command.cc:5:
../sources/gn-0+git/src/gn/err.h:8:10: fatal error: expected: No such file or directory
8 | #include <expected>
| ^~~~~~~~~~
compilation terminated.
[59/216] g++ -MMD -MF src/gn/ffi/value.o.d -I../sources/gn-0+git/src -I../sources/gn-0+git/src/gn/starlark/vendor/cxx/include -I. -isystemTOPDIR/tmp/work/x86_64-linux/gn-native/0+git/recipe-sysroot-native/usr/include -O2 -pipe -Wno-error=maybe-uninitialized -isystemTOPDIR/tmp/work/x86_64-linux/gn-native/0+git/recipe-sysroot-native/usr/include -O2 -pipe -fvisibility-inlines-hidden -DNDEBUG -O3 -g -fdata-sections -ffunction-sections -D_FILE_OFFSET_BITS=64 -D__STDC_CONSTANT_MACROS -D__STDC_FORMAT_MACROS -pthread -pipe -fno-exceptions -fno-rtti -fdiagnostics-color -Wall -Wextra -Wno-unused-parameter -Wextra-semi -Wundef -std=c++23 -Wno-redundant-move -Wno-restrict -Wno-deprecated-copy -Wno-implicit-fallthrough -Wno-redundant-move -Wno-unused-variable -Wno-format -Wno-strict-aliasing -Wno-cast-function-type -c ../sources/gn-0+git/src/gn/ffi/value.cc -o src/gn/ffi/value.o
FAILED: [code=1] src/gn/ffi/value.o
g++ -MMD -MF src/gn/ffi/value.o.d -I../sources/gn-0+git/src -I../sources/gn-0+git/src/gn/starlark/vendor/cxx/include -I. -isystemTOPDIR/tmp/work/x86_64-linux/gn-native/0+git/recipe-sysroot-native/usr/include -O2 -pipe -Wno-error=maybe-uninitialized -isystemTOPDIR/tmp/work/x86_64-linux/gn-native/0+git/recipe-sysroot-native/usr/include -O2 -pipe -fvisibility-inlines-hidden -DNDEBUG -O3 -g -fdata-sections -ffunction-sections -D_FILE_OFFSET_BITS=64 -D__STDC_CONSTANT_MACROS -D__STDC_FORMAT_MACROS -pthread -pipe -fno-exceptions -fno-rtti -fdiagnostics-color -Wall -Wextra -Wno-unused-parameter -Wextra-semi -Wundef -std=c++23 -Wno-redundant-move -Wno-restrict -Wno-deprecated-copy -Wno-implicit-fallthrough -Wno-redundant-move -Wno-unused-variable -Wno-format -Wno-strict-aliasing -Wno-cast-function-type -c ../sources/gn-0+git/src/gn/ffi/value.cc -o src/gn/ffi/value.o
In file included from ../sources/gn-0+git/src/gn/value.h:17,
from ../sources/gn-0+git/src/gn/ffi/value.h:11,
from ../sources/gn-0+git/src/gn/ffi/value.cc:5:
../sources/gn-0+git/src/gn/err.h:8:10: fatal error: expected: No such file or directory
8 | #include <expected>
| ^~~~~~~~~~
compilation terminated.
[60/216] g++ -MMD -MF src/gn/ffi/session.o.d -I../sources/gn-0+git/src -I../sources/gn-0+git/src/gn/starlark/vendor/cxx/include -I. -isystemTOPDIR/tmp/work/x86_64-linux/gn-native/0+git/recipe-sysroot-native/usr/include -O2 -pipe -Wno-error=maybe-uninitialized -isystemTOPDIR/tmp/work/x86_64-linux/gn-native/0+git/recipe-sysroot-native/usr/include -O2 -pipe -fvisibility-inlines-hidden -DNDEBUG -O3 -g -fdata-sections -ffunction-sections -D_FILE_OFFSET_BITS=64 -D__STDC_CONSTANT_MACROS -D__STDC_FORMAT_MACROS -pthread -pipe -fno-exceptions -fno-rtti -fdiagnostics-color -Wall -Wextra -Wno-unused-parameter -Wextra-semi -Wundef -std=c++23 -Wno-redundant-move -Wno-restrict -Wno-deprecated-copy -Wno-implicit-fallthrough -Wno-redundant-move -Wno-unused-variable -Wno-format -Wno-strict-aliasing -Wno-cast-function-type -c ../sources/gn-0+git/src/gn/ffi/session.cc -o src/gn/ffi/session.o
FAILED: [code=1] src/gn/ffi/session.o
g++ -MMD -MF src/gn/ffi/session.o.d -I../sources/gn-0+git/src -I../sources/gn-0+git/src/gn/starlark/vendor/cxx/include -I. -isystemTOPDIR/tmp/work/x86_64-linux/gn-native/0+git/recipe-sysroot-native/usr/include -O2 -pipe -Wno-error=maybe-uninitialized -isystemTOPDIR/tmp/work/x86_64-linux/gn-native/0+git/recipe-sysroot-native/usr/include -O2 -pipe -fvisibility-inlines-hidden -DNDEBUG -O3 -g -fdata-sections -ffunction-sections -D_FILE_OFFSET_BITS=64 -D__STDC_CONSTANT_MACROS -D__STDC_FORMAT_MACROS -pthread -pipe -fno-exceptions -fno-rtti -fdiagnostics-color -Wall -Wextra -Wno-unused-parameter -Wextra-semi -Wundef -std=c++23 -Wno-redundant-move -Wno-restrict -Wno-deprecated-copy -Wno-implicit-fallthrough -Wno-redundant-move -Wno-unused-variable -Wno-format -Wno-strict-aliasing -Wno-cast-function-type -c ../sources/gn-0+git/src/gn/ffi/session.cc -o src/gn/ffi/session.o
In file included from ../sources/gn-0+git/src/gn/scope.h:19,
from ../sources/gn-0+git/src/gn/args.h:15,
from ../sources/gn-0+git/src/gn/build_settings.h:15,
from ../sources/gn-0+git/src/gn/ffi/session.cc:9:
../sources/gn-0+git/src/gn/err.h:8:10: fatal error: expected: No such file or directory
8 | #include <expected>
| ^~~~~~~~~~
compilation terminated.
[61/216] g++ -MMD -MF src/gn/filesystem_utils.o.d -I../sources/gn-0+git/src -I../sources/gn-0+git/src/gn/starlark/vendor/cxx/include -I. -isystemTOPDIR/tmp/work/x86_64-linux/gn-native/0+git/recipe-sysroot-native/usr/include -O2 -pipe -Wno-error=maybe-uninitialized -isystemTOPDIR/tmp/work/x86_64-linux/gn-native/0+git/recipe-sysroot-native/usr/include -O2 -pipe -fvisibility-inlines-hidden -DNDEBUG -O3 -g -fdata-sections -ffunction-sections -D_FILE_OFFSET_BITS=64 -D__STDC_CONSTANT_MACROS -D__STDC_FORMAT_MACROS -pthread -pipe -fno-exceptions -fno-rtti -fdiagnostics-color -Wall -Wextra -Wno-unused-parameter -Wextra-semi -Wundef -std=c++23 -Wno-redundant-move -Wno-restrict -Wno-deprecated-copy -Wno-implicit-fallthrough -Wno-redundant-move -Wno-unused-variable -Wno-format -Wno-strict-aliasing -Wno-cast-function-type -c ../sources/gn-0+git/src/gn/filesystem_utils.cc -o src/gn/filesystem_utils.o
FAILED: [code=1] src/gn/filesystem_utils.o
g++ -MMD -MF src/gn/filesystem_utils.o.d -I../sources/gn-0+git/src -I../sources/gn-0+git/src/gn/starlark/vendor/cxx/include -I. -isystemTOPDIR/tmp/work/x86_64-linux/gn-native/0+git/recipe-sysroot-native/usr/include -O2 -pipe -Wno-error=maybe-uninitialized -isystemTOPDIR/tmp/work/x86_64-linux/gn-native/0+git/recipe-sysroot-native/usr/include -O2 -pipe -fvisibility-inlines-hidden -DNDEBUG -O3 -g -fdata-sections -ffunction-sections -D_FILE_OFFSET_BITS=64 -D__STDC_CONSTANT_MACROS -D__STDC_FORMAT_MACROS -pthread -pipe -fno-exceptions -fno-rtti -fdiagnostics-color -Wall -Wextra -Wno-unused-parameter -Wextra-semi -Wundef -std=c++23 -Wno-redundant-move -Wno-restrict -Wno-deprecated-copy -Wno-implicit-fallthrough -Wno-redundant-move -Wno-unused-variable -Wno-format -Wno-strict-aliasing -Wno-cast-function-type -c ../sources/gn-0+git/src/gn/filesystem_utils.cc -o src/gn/filesystem_utils.o
In file included from ../sources/gn-0+git/src/gn/scope.h:19,
from ../sources/gn-0+git/src/gn/settings.h:11,
from ../sources/gn-0+git/src/gn/filesystem_utils.h:14,
from ../sources/gn-0+git/src/gn/filesystem_utils.cc:5:
../sources/gn-0+git/src/gn/err.h:8:10: fatal error: expected: No such file or directory
8 | #include <expected>
| ^~~~~~~~~~
compilation terminated.
[62/216] g++ -MMD -MF src/gn/file_writer.o.d -I../sources/gn-0+git/src -I../sources/gn-0+git/src/gn/starlark/vendor/cxx/include -I. -isystemTOPDIR/tmp/work/x86_64-linux/gn-native/0+git/recipe-sysroot-native/usr/include -O2 -pipe -Wno-error=maybe-uninitialized -isystemTOPDIR/tmp/work/x86_64-linux/gn-native/0+git/recipe-sysroot-native/usr/include -O2 -pipe -fvisibility-inlines-hidden -DNDEBUG -O3 -g -fdata-sections -ffunction-sections -D_FILE_OFFSET_BITS=64 -D__STDC_CONSTANT_MACROS -D__STDC_FORMAT_MACROS -pthread -pipe -fno-exceptions -fno-rtti -fdiagnostics-color -Wall -Wextra -Wno-unused-parameter -Wextra-semi -Wundef -std=c++23 -Wno-redundant-move -Wno-restrict -Wno-deprecated-copy -Wno-implicit-fallthrough -Wno-redundant-move -Wno-unused-variable -Wno-format -Wno-strict-aliasing -Wno-cast-function-type -c ../sources/gn-0+git/src/gn/file_writer.cc -o src/gn/file_writer.o
FAILED: [code=1] src/gn/file_writer.o
g++ -MMD -MF src/gn/file_writer.o.d -I../sources/gn-0+git/src -I../sources/gn-0+git/src/gn/starlark/vendor/cxx/include -I. -isystemTOPDIR/tmp/work/x86_64-linux/gn-native/0+git/recipe-sysroot-native/usr/include -O2 -pipe -Wno-error=maybe-uninitialized -isystemTOPDIR/tmp/work/x86_64-linux/gn-native/0+git/recipe-sysroot-native/usr/include -O2 -pipe -fvisibility-inlines-hidden -DNDEBUG -O3 -g -fdata-sections -ffunction-sections -D_FILE_OFFSET_BITS=64 -D__STDC_CONSTANT_MACROS -D__STDC_FORMAT_MACROS -pthread -pipe -fno-exceptions -fno-rtti -fdiagnostics-color -Wall -Wextra -Wno-unused-parameter -Wextra-semi -Wundef -std=c++23 -Wno-redundant-move -Wno-restrict -Wno-deprecated-copy -Wno-implicit-fallthrough -Wno-redundant-move -Wno-unused-variable -Wno-format -Wno-strict-aliasing -Wno-cast-function-type -c ../sources/gn-0+git/src/gn/file_writer.cc -o src/gn/file_writer.o
In file included from ../sources/gn-0+git/src/gn/scope.h:19,
from ../sources/gn-0+git/src/gn/settings.h:11,
from ../sources/gn-0+git/src/gn/filesystem_utils.h:14,
from ../sources/gn-0+git/src/gn/file_writer.cc:9:
../sources/gn-0+git/src/gn/err.h:8:10: fatal error: expected: No such file or directory
8 | #include <expected>
| ^~~~~~~~~~
compilation terminated.
[63/216] g++ -MMD -MF src/gn/frameworks_utils.o.d -I../sources/gn-0+git/src -I../sources/gn-0+git/src/gn/starlark/vendor/cxx/include -I. -isystemTOPDIR/tmp/work/x86_64-linux/gn-native/0+git/recipe-sysroot-native/usr/include -O2 -pipe -Wno-error=maybe-uninitialized -isystemTOPDIR/tmp/work/x86_64-linux/gn-native/0+git/recipe-sysroot-native/usr/include -O2 -pipe -fvisibility-inlines-hidden -DNDEBUG -O3 -g -fdata-sections -ffunction-sections -D_FILE_OFFSET_BITS=64 -D__STDC_CONSTANT_MACROS -D__STDC_FORMAT_MACROS -pthread -pipe -fno-exceptions -fno-rtti -fdiagnostics-color -Wall -Wextra -Wno-unused-parameter -Wextra-semi -Wundef -std=c++23 -Wno-redundant-move -Wno-restrict -Wno-deprecated-copy -Wno-implicit-fallthrough -Wno-redundant-move -Wno-unused-variable -Wno-format -Wno-strict-aliasing -Wno-cast-function-type -c ../sources/gn-0+git/src/gn/frameworks_utils.cc -o src/gn/frameworks_utils.o
FAILED: [code=1] src/gn/frameworks_utils.o
g++ -MMD -MF src/gn/frameworks_utils.o.d -I../sources/gn-0+git/src -I../sources/gn-0+git/src/gn/starlark/vendor/cxx/include -I. -isystemTOPDIR/tmp/work/x86_64-linux/gn-native/0+git/recipe-sysroot-native/usr/include -O2 -pipe -Wno-error=maybe-uninitialized -isystemTOPDIR/tmp/work/x86_64-linux/gn-native/0+git/recipe-sysroot-native/usr/include -O2 -pipe -fvisibility-inlines-hidden -DNDEBUG -O3 -g -fdata-sections -ffunction-sections -D_FILE_OFFSET_BITS=64 -D__STDC_CONSTANT_MACROS -D__STDC_FORMAT_MACROS -pthread -pipe -fno-exceptions -fno-rtti -fdiagnostics-color -Wall -Wextra -Wno-unused-parameter -Wextra-semi -Wundef -std=c++23 -Wno-redundant-move -Wno-restrict -Wno-deprecated-copy -Wno-implicit-fallthrough -Wno-redundant-move -Wno-unused-variable -Wno-format -Wno-strict-aliasing -Wno-cast-function-type -c ../sources/gn-0+git/src/gn/frameworks_utils.cc -o src/gn/frameworks_utils.o
In file included from ../sources/gn-0+git/src/gn/scope.h:19,
from ../sources/gn-0+git/src/gn/settings.h:11,
from ../sources/gn-0+git/src/gn/filesystem_utils.h:14,
from ../sources/gn-0+git/src/gn/frameworks_utils.cc:7:
../sources/gn-0+git/src/gn/err.h:8:10: fatal error: expected: No such file or directory
8 | #include <expected>
| ^~~~~~~~~~
compilation terminated.
[64/216] g++ -MMD -MF src/gn/function_exec_script.o.d -I../sources/gn-0+git/src -I../sources/gn-0+git/src/gn/starlark/vendor/cxx/include -I. -isystemTOPDIR/tmp/work/x86_64-linux/gn-native/0+git/recipe-sysroot-native/usr/include -O2 -pipe -Wno-error=maybe-uninitialized -isystemTOPDIR/tmp/work/x86_64-linux/gn-native/0+git/recipe-sysroot-native/usr/include -O2 -pipe -fvisibility-inlines-hidden -DNDEBUG -O3 -g -fdata-sections -ffunction-sections -D_FILE_OFFSET_BITS=64 -D__STDC_CONSTANT_MACROS -D__STDC_FORMAT_MACROS -pthread -pipe -fno-exceptions -fno-rtti -fdiagnostics-color -Wall -Wextra -Wno-unused-parameter -Wextra-semi -Wundef -std=c++23 -Wno-redundant-move -Wno-restrict -Wno-deprecated-copy -Wno-implicit-fallthrough -Wno-redundant-move -Wno-unused-variable -Wno-format -Wno-strict-aliasing -Wno-cast-function-type -c ../sources/gn-0+git/src/gn/function_exec_script.cc -o src/gn/function_exec_script.o
FAILED: [code=1] src/gn/function_exec_script.o
g++ -MMD -MF src/gn/function_exec_script.o.d -I../sources/gn-0+git/src -I../sources/gn-0+git/src/gn/starlark/vendor/cxx/include -I. -isystemTOPDIR/tmp/work/x86_64-linux/gn-native/0+git/recipe-sysroot-native/usr/include -O2 -pipe -Wno-error=maybe-uninitialized -isystemTOPDIR/tmp/work/x86_64-linux/gn-native/0+git/recipe-sysroot-native/usr/include -O2 -pipe -fvisibility-inlines-hidden -DNDEBUG -O3 -g -fdata-sections -ffunction-sections -D_FILE_OFFSET_BITS=64 -D__STDC_CONSTANT_MACROS -D__STDC_FORMAT_MACROS -pthread -pipe -fno-exceptions -fno-rtti -fdiagnostics-color -Wall -Wextra -Wno-unused-parameter -Wextra-semi -Wundef -std=c++23 -Wno-redundant-move -Wno-restrict -Wno-deprecated-copy -Wno-implicit-fallthrough -Wno-redundant-move -Wno-unused-variable -Wno-format -Wno-strict-aliasing -Wno-cast-function-type -c ../sources/gn-0+git/src/gn/function_exec_script.cc -o src/gn/function_exec_script.o
In file included from ../sources/gn-0+git/src/gn/function_exec_script.cc:10:
../sources/gn-0+git/src/gn/err.h:8:10: fatal error: expected: No such file or directory
8 | #include <expected>
| ^~~~~~~~~~
compilation terminated.
[65/216] g++ -MMD -MF src/gn/function_foreach.o.d -I../sources/gn-0+git/src -I../sources/gn-0+git/src/gn/starlark/vendor/cxx/include -I. -isystemTOPDIR/tmp/work/x86_64-linux/gn-native/0+git/recipe-sysroot-native/usr/include -O2 -pipe -Wno-error=maybe-uninitialized -isystemTOPDIR/tmp/work/x86_64-linux/gn-native/0+git/recipe-sysroot-native/usr/include -O2 -pipe -fvisibility-inlines-hidden -DNDEBUG -O3 -g -fdata-sections -ffunction-sections -D_FILE_OFFSET_BITS=64 -D__STDC_CONSTANT_MACROS -D__STDC_FORMAT_MACROS -pthread -pipe -fno-exceptions -fno-rtti -fdiagnostics-color -Wall -Wextra -Wno-unused-parameter -Wextra-semi -Wundef -std=c++23 -Wno-redundant-move -Wno-restrict -Wno-deprecated-copy -Wno-implicit-fallthrough -Wno-redundant-move -Wno-unused-variable -Wno-format -Wno-strict-aliasing -Wno-cast-function-type -c ../sources/gn-0+git/src/gn/function_foreach.cc -o src/gn/function_foreach.o
FAILED: [code=1] src/gn/function_foreach.o
g++ -MMD -MF src/gn/function_foreach.o.d -I../sources/gn-0+git/src -I../sources/gn-0+git/src/gn/starlark/vendor/cxx/include -I. -isystemTOPDIR/tmp/work/x86_64-linux/gn-native/0+git/recipe-sysroot-native/usr/include -O2 -pipe -Wno-error=maybe-uninitialized -isystemTOPDIR/tmp/work/x86_64-linux/gn-native/0+git/recipe-sysroot-native/usr/include -O2 -pipe -fvisibility-inlines-hidden -DNDEBUG -O3 -g -fdata-sections -ffunction-sections -D_FILE_OFFSET_BITS=64 -D__STDC_CONSTANT_MACROS -D__STDC_FORMAT_MACROS -pthread -pipe -fno-exceptions -fno-rtti -fdiagnostics-color -Wall -Wextra -Wno-unused-parameter -Wextra-semi -Wundef -std=c++23 -Wno-redundant-move -Wno-restrict -Wno-deprecated-copy -Wno-implicit-fallthrough -Wno-redundant-move -Wno-unused-variable -Wno-format -Wno-strict-aliasing -Wno-cast-function-type -c ../sources/gn-0+git/src/gn/function_foreach.cc -o src/gn/function_foreach.o
In file included from ../sources/gn-0+git/src/gn/function_foreach.cc:5:
../sources/gn-0+git/src/gn/err.h:8:10: fatal error: expected: No such file or directory
8 | #include <expected>
| ^~~~~~~~~~
compilation terminated.
[66/216] g++ -MMD -MF src/gn/function_forward_variables_from.o.d -I../sources/gn-0+git/src -I../sources/gn-0+git/src/gn/starlark/vendor/cxx/include -I. -isystemTOPDIR/tmp/work/x86_64-linux/gn-native/0+git/recipe-sysroot-native/usr/include -O2 -pipe -Wno-error=maybe-uninitialized -isystemTOPDIR/tmp/work/x86_64-linux/gn-native/0+git/recipe-sysroot-native/usr/include -O2 -pipe -fvisibility-inlines-hidden -DNDEBUG -O3 -g -fdata-sections -ffunction-sections -D_FILE_OFFSET_BITS=64 -D__STDC_CONSTANT_MACROS -D__STDC_FORMAT_MACROS -pthread -pipe -fno-exceptions -fno-rtti -fdiagnostics-color -Wall -Wextra -Wno-unused-parameter -Wextra-semi -Wundef -std=c++23 -Wno-redundant-move -Wno-restrict -Wno-deprecated-copy -Wno-implicit-fallthrough -Wno-redundant-move -Wno-unused-variable -Wno-format -Wno-strict-aliasing -Wno-cast-function-type -c ../sources/gn-0+git/src/gn/function_forward_variables_from.cc -o src/gn/function_forward_variables_from.o
FAILED: [code=1] src/gn/function_forward_variables_from.o
g++ -MMD -MF src/gn/function_forward_variables_from.o.d -I../sources/gn-0+git/src -I../sources/gn-0+git/src/gn/starlark/vendor/cxx/include -I. -isystemTOPDIR/tmp/work/x86_64-linux/gn-native/0+git/recipe-sysroot-native/usr/include -O2 -pipe -Wno-error=maybe-uninitialized -isystemTOPDIR/tmp/work/x86_64-linux/gn-native/0+git/recipe-sysroot-native/usr/include -O2 -pipe -fvisibility-inlines-hidden -DNDEBUG -O3 -g -fdata-sections -ffunction-sections -D_FILE_OFFSET_BITS=64 -D__STDC_CONSTANT_MACROS -D__STDC_FORMAT_MACROS -pthread -pipe -fno-exceptions -fno-rtti -fdiagnostics-color -Wall -Wextra -Wno-unused-parameter -Wextra-semi -Wundef -std=c++23 -Wno-redundant-move -Wno-restrict -Wno-deprecated-copy -Wno-implicit-fallthrough -Wno-redundant-move -Wno-unused-variable -Wno-format -Wno-strict-aliasing -Wno-cast-function-type -c ../sources/gn-0+git/src/gn/function_forward_variables_from.cc -o src/gn/function_forward_variables_from.o
In file included from ../sources/gn-0+git/src/gn/function_forward_variables_from.cc:5:
../sources/gn-0+git/src/gn/err.h:8:10: fatal error: expected: No such file or directory
8 | #include <expected>
| ^~~~~~~~~~
compilation terminated.
[67/216] g++ -MMD -MF src/gn/function_get_label_info.o.d -I../sources/gn-0+git/src -I../sources/gn-0+git/src/gn/starlark/vendor/cxx/include -I. -isystemTOPDIR/tmp/work/x86_64-linux/gn-native/0+git/recipe-sysroot-native/usr/include -O2 -pipe -Wno-error=maybe-uninitialized -isystemTOPDIR/tmp/work/x86_64-linux/gn-native/0+git/recipe-sysroot-native/usr/include -O2 -pipe -fvisibility-inlines-hidden -DNDEBUG -O3 -g -fdata-sections -ffunction-sections -D_FILE_OFFSET_BITS=64 -D__STDC_CONSTANT_MACROS -D__STDC_FORMAT_MACROS -pthread -pipe -fno-exceptions -fno-rtti -fdiagnostics-color -Wall -Wextra -Wno-unused-parameter -Wextra-semi -Wundef -std=c++23 -Wno-redundant-move -Wno-restrict -Wno-deprecated-copy -Wno-implicit-fallthrough -Wno-redundant-move -Wno-unused-variable -Wno-format -Wno-strict-aliasing -Wno-cast-function-type -c ../sources/gn-0+git/src/gn/function_get_label_info.cc -o src/gn/function_get_label_info.o
FAILED: [code=1] src/gn/function_get_label_info.o
g++ -MMD -MF src/gn/function_get_label_info.o.d -I../sources/gn-0+git/src -I../sources/gn-0+git/src/gn/starlark/vendor/cxx/include -I. -isystemTOPDIR/tmp/work/x86_64-linux/gn-native/0+git/recipe-sysroot-native/usr/include -O2 -pipe -Wno-error=maybe-uninitialized -isystemTOPDIR/tmp/work/x86_64-linux/gn-native/0+git/recipe-sysroot-native/usr/include -O2 -pipe -fvisibility-inlines-hidden -DNDEBUG -O3 -g -fdata-sections -ffunction-sections -D_FILE_OFFSET_BITS=64 -D__STDC_CONSTANT_MACROS -D__STDC_FORMAT_MACROS -pthread -pipe -fno-exceptions -fno-rtti -fdiagnostics-color -Wall -Wextra -Wno-unused-parameter -Wextra-semi -Wundef -std=c++23 -Wno-redundant-move -Wno-restrict -Wno-deprecated-copy -Wno-implicit-fallthrough -Wno-redundant-move -Wno-unused-variable -Wno-format -Wno-strict-aliasing -Wno-cast-function-type -c ../sources/gn-0+git/src/gn/function_get_label_info.cc -o src/gn/function_get_label_info.o
In file included from ../sources/gn-0+git/src/gn/function_get_label_info.cc:5:
../sources/gn-0+git/src/gn/err.h:8:10: fatal error: expected: No such file or directory
8 | #include <expected>
| ^~~~~~~~~~
compilation terminated.
[68/216] g++ -MMD -MF src/gn/function_get_path_info.o.d -I../sources/gn-0+git/src -I../sources/gn-0+git/src/gn/starlark/vendor/cxx/include -I. -isystemTOPDIR/tmp/work/x86_64-linux/gn-native/0+git/recipe-sysroot-native/usr/include -O2 -pipe -Wno-error=maybe-uninitialized -isystemTOPDIR/tmp/work/x86_64-linux/gn-native/0+git/recipe-sysroot-native/usr/include -O2 -pipe -fvisibility-inlines-hidden -DNDEBUG -O3 -g -fdata-sections -ffunction-sections -D_FILE_OFFSET_BITS=64 -D__STDC_CONSTANT_MACROS -D__STDC_FORMAT_MACROS -pthread -pipe -fno-exceptions -fno-rtti -fdiagnostics-color -Wall -Wextra -Wno-unused-parameter -Wextra-semi -Wundef -std=c++23 -Wno-redundant-move -Wno-restrict -Wno-deprecated-copy -Wno-implicit-fallthrough -Wno-redundant-move -Wno-unused-variable -Wno-format -Wno-strict-aliasing -Wno-cast-function-type -c ../sources/gn-0+git/src/gn/function_get_path_info.cc -o src/gn/function_get_path_info.o
FAILED: [code=1] src/gn/function_get_path_info.o
g++ -MMD -MF src/gn/function_get_path_info.o.d -I../sources/gn-0+git/src -I../sources/gn-0+git/src/gn/starlark/vendor/cxx/include -I. -isystemTOPDIR/tmp/work/x86_64-linux/gn-native/0+git/recipe-sysroot-native/usr/include -O2 -pipe -Wno-error=maybe-uninitialized -isystemTOPDIR/tmp/work/x86_64-linux/gn-native/0+git/recipe-sysroot-native/usr/include -O2 -pipe -fvisibility-inlines-hidden -DNDEBUG -O3 -g -fdata-sections -ffunction-sections -D_FILE_OFFSET_BITS=64 -D__STDC_CONSTANT_MACROS -D__STDC_FORMAT_MACROS -pthread -pipe -fno-exceptions -fno-rtti -fdiagnostics-color -Wall -Wextra -Wno-unused-parameter -Wextra-semi -Wundef -std=c++23 -Wno-redundant-move -Wno-restrict -Wno-deprecated-copy -Wno-implicit-fallthrough -Wno-redundant-move -Wno-unused-variable -Wno-format -Wno-strict-aliasing -Wno-cast-function-type -c ../sources/gn-0+git/src/gn/function_get_path_info.cc -o src/gn/function_get_path_info.o
In file included from ../sources/gn-0+git/src/gn/function_get_path_info.cc:7:
../sources/gn-0+git/src/gn/err.h:8:10: fatal error: expected: No such file or directory
8 | #include <expected>
| ^~~~~~~~~~
compilation terminated.
[69/216] g++ -MMD -MF src/gn/function_len.o.d -I../sources/gn-0+git/src -I../sources/gn-0+git/src/gn/starlark/vendor/cxx/include -I. -isystemTOPDIR/tmp/work/x86_64-linux/gn-native/0+git/recipe-sysroot-native/usr/include -O2 -pipe -Wno-error=maybe-uninitialized -isystemTOPDIR/tmp/work/x86_64-linux/gn-native/0+git/recipe-sysroot-native/usr/include -O2 -pipe -fvisibility-inlines-hidden -DNDEBUG -O3 -g -fdata-sections -ffunction-sections -D_FILE_OFFSET_BITS=64 -D__STDC_CONSTANT_MACROS -D__STDC_FORMAT_MACROS -pthread -pipe -fno-exceptions -fno-rtti -fdiagnostics-color -Wall -Wextra -Wno-unused-parameter -Wextra-semi -Wundef -std=c++23 -Wno-redundant-move -Wno-restrict -Wno-deprecated-copy -Wno-implicit-fallthrough -Wno-redundant-move -Wno-unused-variable -Wno-format -Wno-strict-aliasing -Wno-cast-function-type -c ../sources/gn-0+git/src/gn/function_len.cc -o src/gn/function_len.o
FAILED: [code=1] src/gn/function_len.o
g++ -MMD -MF src/gn/function_len.o.d -I../sources/gn-0+git/src -I../sources/gn-0+git/src/gn/starlark/vendor/cxx/include -I. -isystemTOPDIR/tmp/work/x86_64-linux/gn-native/0+git/recipe-sysroot-native/usr/include -O2 -pipe -Wno-error=maybe-uninitialized -isystemTOPDIR/tmp/work/x86_64-linux/gn-native/0+git/recipe-sysroot-native/usr/include -O2 -pipe -fvisibility-inlines-hidden -DNDEBUG -O3 -g -fdata-sections -ffunction-sections -D_FILE_OFFSET_BITS=64 -D__STDC_CONSTANT_MACROS -D__STDC_FORMAT_MACROS -pthread -pipe -fno-exceptions -fno-rtti -fdiagnostics-color -Wall -Wextra -Wno-unused-parameter -Wextra-semi -Wundef -std=c++23 -Wno-redundant-move -Wno-restrict -Wno-deprecated-copy -Wno-implicit-fallthrough -Wno-redundant-move -Wno-unused-variable -Wno-format -Wno-strict-aliasing -Wno-cast-function-type -c ../sources/gn-0+git/src/gn/function_len.cc -o src/gn/function_len.o
In file included from ../sources/gn-0+git/src/gn/function_len.cc:7:
../sources/gn-0+git/src/gn/err.h:8:10: fatal error: expected: No such file or directory
8 | #include <expected>
| ^~~~~~~~~~
compilation terminated.
[70/216] g++ -MMD -MF src/gn/function_filter_labels.o.d -I../sources/gn-0+git/src -I../sources/gn-0+git/src/gn/starlark/vendor/cxx/include -I. -isystemTOPDIR/tmp/work/x86_64-linux/gn-native/0+git/recipe-sysroot-native/usr/include -O2 -pipe -Wno-error=maybe-uninitialized -isystemTOPDIR/tmp/work/x86_64-linux/gn-native/0+git/recipe-sysroot-native/usr/include -O2 -pipe -fvisibility-inlines-hidden -DNDEBUG -O3 -g -fdata-sections -ffunction-sections -D_FILE_OFFSET_BITS=64 -D__STDC_CONSTANT_MACROS -D__STDC_FORMAT_MACROS -pthread -pipe -fno-exceptions -fno-rtti -fdiagnostics-color -Wall -Wextra -Wno-unused-parameter -Wextra-semi -Wundef -std=c++23 -Wno-redundant-move -Wno-restrict -Wno-deprecated-copy -Wno-implicit-fallthrough -Wno-redundant-move -Wno-unused-variable -Wno-format -Wno-strict-aliasing -Wno-cast-function-type -c ../sources/gn-0+git/src/gn/function_filter_labels.cc -o src/gn/function_filter_labels.o
FAILED: [code=1] src/gn/function_filter_labels.o
g++ -MMD -MF src/gn/function_filter_labels.o.d -I../sources/gn-0+git/src -I../sources/gn-0+git/src/gn/starlark/vendor/cxx/include -I. -isystemTOPDIR/tmp/work/x86_64-linux/gn-native/0+git/recipe-sysroot-native/usr/include -O2 -pipe -Wno-error=maybe-uninitialized -isystemTOPDIR/tmp/work/x86_64-linux/gn-native/0+git/recipe-sysroot-native/usr/include -O2 -pipe -fvisibility-inlines-hidden -DNDEBUG -O3 -g -fdata-sections -ffunction-sections -D_FILE_OFFSET_BITS=64 -D__STDC_CONSTANT_MACROS -D__STDC_FORMAT_MACROS -pthread -pipe -fno-exceptions -fno-rtti -fdiagnostics-color -Wall -Wextra -Wno-unused-parameter -Wextra-semi -Wundef -std=c++23 -Wno-redundant-move -Wno-restrict -Wno-deprecated-copy -Wno-implicit-fallthrough -Wno-redundant-move -Wno-unused-variable -Wno-format -Wno-strict-aliasing -Wno-cast-function-type -c ../sources/gn-0+git/src/gn/function_filter_labels.cc -o src/gn/function_filter_labels.o
In file included from ../sources/gn-0+git/src/gn/scope.h:19,
from ../sources/gn-0+git/src/gn/args.h:15,
from ../sources/gn-0+git/src/gn/build_settings.h:15,
from ../sources/gn-0+git/src/gn/function_filter_labels.cc:7:
../sources/gn-0+git/src/gn/err.h:8:10: fatal error: expected: No such file or directory
8 | #include <expected>
| ^~~~~~~~~~
compilation terminated.
[71/216] g++ -MMD -MF src/gn/function_expand_directory.o.d -I../sources/gn-0+git/src -I../sources/gn-0+git/src/gn/starlark/vendor/cxx/include -I. -isystemTOPDIR/tmp/work/x86_64-linux/gn-native/0+git/recipe-sysroot-native/usr/include -O2 -pipe -Wno-error=maybe-uninitialized -isystemTOPDIR/tmp/work/x86_64-linux/gn-native/0+git/recipe-sysroot-native/usr/include -O2 -pipe -fvisibility-inlines-hidden -DNDEBUG -O3 -g -fdata-sections -ffunction-sections -D_FILE_OFFSET_BITS=64 -D__STDC_CONSTANT_MACROS -D__STDC_FORMAT_MACROS -pthread -pipe -fno-exceptions -fno-rtti -fdiagnostics-color -Wall -Wextra -Wno-unused-parameter -Wextra-semi -Wundef -std=c++23 -Wno-redundant-move -Wno-restrict -Wno-deprecated-copy -Wno-implicit-fallthrough -Wno-redundant-move -Wno-unused-variable -Wno-format -Wno-strict-aliasing -Wno-cast-function-type -c ../sources/gn-0+git/src/gn/function_expand_directory.cc -o src/gn/function_expand_directory.o
FAILED: [code=1] src/gn/function_expand_directory.o
g++ -MMD -MF src/gn/function_expand_directory.o.d -I../sources/gn-0+git/src -I../sources/gn-0+git/src/gn/starlark/vendor/cxx/include -I. -isystemTOPDIR/tmp/work/x86_64-linux/gn-native/0+git/recipe-sysroot-native/usr/include -O2 -pipe -Wno-error=maybe-uninitialized -isystemTOPDIR/tmp/work/x86_64-linux/gn-native/0+git/recipe-sysroot-native/usr/include -O2 -pipe -fvisibility-inlines-hidden -DNDEBUG -O3 -g -fdata-sections -ffunction-sections -D_FILE_OFFSET_BITS=64 -D__STDC_CONSTANT_MACROS -D__STDC_FORMAT_MACROS -pthread -pipe -fno-exceptions -fno-rtti -fdiagnostics-color -Wall -Wextra -Wno-unused-parameter -Wextra-semi -Wundef -std=c++23 -Wno-redundant-move -Wno-restrict -Wno-deprecated-copy -Wno-implicit-fallthrough -Wno-redundant-move -Wno-unused-variable -Wno-format -Wno-strict-aliasing -Wno-cast-function-type -c ../sources/gn-0+git/src/gn/function_expand_directory.cc -o src/gn/function_expand_directory.o
In file included from ../sources/gn-0+git/src/gn/function_expand_directory.cc:16:
../sources/gn-0+git/src/gn/err.h:8:10: fatal error: expected: No such file or directory
8 | #include <expected>
| ^~~~~~~~~~
compilation terminated.
[72/216] g++ -MMD -MF src/gn/ffi/intern_string.o.d -I../sources/gn-0+git/src -I../sources/gn-0+git/src/gn/starlark/vendor/cxx/include -I. -isystemTOPDIR/tmp/work/x86_64-linux/gn-native/0+git/recipe-sysroot-native/usr/include -O2 -pipe -Wno-error=maybe-uninitialized -isystemTOPDIR/tmp/work/x86_64-linux/gn-native/0+git/recipe-sysroot-native/usr/include -O2 -pipe -fvisibility-inlines-hidden -DNDEBUG -O3 -g -fdata-sections -ffunction-sections -D_FILE_OFFSET_BITS=64 -D__STDC_CONSTANT_MACROS -D__STDC_FORMAT_MACROS -pthread -pipe -fno-exceptions -fno-rtti -fdiagnostics-color -Wall -Wextra -Wno-unused-parameter -Wextra-semi -Wundef -std=c++23 -Wno-redundant-move -Wno-restrict -Wno-deprecated-copy -Wno-implicit-fallthrough -Wno-redundant-move -Wno-unused-variable -Wno-format -Wno-strict-aliasing -Wno-cast-function-type -c ../sources/gn-0+git/src/gn/ffi/intern_string.cc -o src/gn/ffi/intern_string.o
[73/216] g++ -MMD -MF src/gn/function_set_defaults.o.d -I../sources/gn-0+git/src -I../sources/gn-0+git/src/gn/starlark/vendor/cxx/include -I. -isystemTOPDIR/tmp/work/x86_64-linux/gn-native/0+git/recipe-sysroot-native/usr/include -O2 -pipe -Wno-error=maybe-uninitialized -isystemTOPDIR/tmp/work/x86_64-linux/gn-native/0+git/recipe-sysroot-native/usr/include -O2 -pipe -fvisibility-inlines-hidden -DNDEBUG -O3 -g -fdata-sections -ffunction-sections -D_FILE_OFFSET_BITS=64 -D__STDC_CONSTANT_MACROS -D__STDC_FORMAT_MACROS -pthread -pipe -fno-exceptions -fno-rtti -fdiagnostics-color -Wall -Wextra -Wno-unused-parameter -Wextra-semi -Wundef -std=c++23 -Wno-redundant-move -Wno-restrict -Wno-deprecated-copy -Wno-implicit-fallthrough -Wno-redundant-move -Wno-unused-variable -Wno-format -Wno-strict-aliasing -Wno-cast-function-type -c ../sources/gn-0+git/src/gn/function_set_defaults.cc -o src/gn/function_set_defaults.o
FAILED: [code=1] src/gn/function_set_defaults.o
g++ -MMD -MF src/gn/function_set_defaults.o.d -I../sources/gn-0+git/src -I../sources/gn-0+git/src/gn/starlark/vendor/cxx/include -I. -isystemTOPDIR/tmp/work/x86_64-linux/gn-native/0+git/recipe-sysroot-native/usr/include -O2 -pipe -Wno-error=maybe-uninitialized -isystemTOPDIR/tmp/work/x86_64-linux/gn-native/0+git/recipe-sysroot-native/usr/include -O2 -pipe -fvisibility-inlines-hidden -DNDEBUG -O3 -g -fdata-sections -ffunction-sections -D_FILE_OFFSET_BITS=64 -D__STDC_CONSTANT_MACROS -D__STDC_FORMAT_MACROS -pthread -pipe -fno-exceptions -fno-rtti -fdiagnostics-color -Wall -Wextra -Wno-unused-parameter -Wextra-semi -Wundef -std=c++23 -Wno-redundant-move -Wno-restrict -Wno-deprecated-copy -Wno-implicit-fallthrough -Wno-redundant-move -Wno-unused-variable -Wno-format -Wno-strict-aliasing -Wno-cast-function-type -c ../sources/gn-0+git/src/gn/function_set_defaults.cc -o src/gn/function_set_defaults.o
In file included from ../sources/gn-0+git/src/gn/function_set_defaults.cc:5:
../sources/gn-0+git/src/gn/err.h:8:10: fatal error: expected: No such file or directory
8 | #include <expected>
| ^~~~~~~~~~
compilation terminated.
[74/216] g++ -MMD -MF src/gn/function_get_target_outputs.o.d -I../sources/gn-0+git/src -I../sources/gn-0+git/src/gn/starlark/vendor/cxx/include -I. -isystemTOPDIR/tmp/work/x86_64-linux/gn-native/0+git/recipe-sysroot-native/usr/include -O2 -pipe -Wno-error=maybe-uninitialized -isystemTOPDIR/tmp/work/x86_64-linux/gn-native/0+git/recipe-sysroot-native/usr/include -O2 -pipe -fvisibility-inlines-hidden -DNDEBUG -O3 -g -fdata-sections -ffunction-sections -D_FILE_OFFSET_BITS=64 -D__STDC_CONSTANT_MACROS -D__STDC_FORMAT_MACROS -pthread -pipe -fno-exceptions -fno-rtti -fdiagnostics-color -Wall -Wextra -Wno-unused-parameter -Wextra-semi -Wundef -std=c++23 -Wno-redundant-move -Wno-restrict -Wno-deprecated-copy -Wno-implicit-fallthrough -Wno-redundant-move -Wno-unused-variable -Wno-format -Wno-strict-aliasing -Wno-cast-function-type -c ../sources/gn-0+git/src/gn/function_get_target_outputs.cc -o src/gn/function_get_target_outputs.o
FAILED: [code=1] src/gn/function_get_target_outputs.o
g++ -MMD -MF src/gn/function_get_target_outputs.o.d -I../sources/gn-0+git/src -I../sources/gn-0+git/src/gn/starlark/vendor/cxx/include -I. -isystemTOPDIR/tmp/work/x86_64-linux/gn-native/0+git/recipe-sysroot-native/usr/include -O2 -pipe -Wno-error=maybe-uninitialized -isystemTOPDIR/tmp/work/x86_64-linux/gn-native/0+git/recipe-sysroot-native/usr/include -O2 -pipe -fvisibility-inlines-hidden -DNDEBUG -O3 -g -fdata-sections -ffunction-sections -D_FILE_OFFSET_BITS=64 -D__STDC_CONSTANT_MACROS -D__STDC_FORMAT_MACROS -pthread -pipe -fno-exceptions -fno-rtti -fdiagnostics-color -Wall -Wextra -Wno-unused-parameter -Wextra-semi -Wundef -std=c++23 -Wno-redundant-move -Wno-restrict -Wno-deprecated-copy -Wno-implicit-fallthrough -Wno-redundant-move -Wno-unused-variable -Wno-format -Wno-strict-aliasing -Wno-cast-function-type -c ../sources/gn-0+git/src/gn/function_get_target_outputs.cc -o src/gn/function_get_target_outputs.o
In file included from ../sources/gn-0+git/src/gn/scope.h:19,
from ../sources/gn-0+git/src/gn/args.h:15,
from ../sources/gn-0+git/src/gn/build_settings.h:15,
from ../sources/gn-0+git/src/gn/function_get_target_outputs.cc:5:
../sources/gn-0+git/src/gn/err.h:8:10: fatal error: expected: No such file or directory
8 | #include <expected>
| ^~~~~~~~~~
compilation terminated.
[75/216] g++ -MMD -MF src/gn/ffi/scope.o.d -I../sources/gn-0+git/src -I../sources/gn-0+git/src/gn/starlark/vendor/cxx/include -I. -isystemTOPDIR/tmp/work/x86_64-linux/gn-native/0+git/recipe-sysroot-native/usr/include -O2 -pipe -Wno-error=maybe-uninitialized -isystemTOPDIR/tmp/work/x86_64-linux/gn-native/0+git/recipe-sysroot-native/usr/include -O2 -pipe -fvisibility-inlines-hidden -DNDEBUG -O3 -g -fdata-sections -ffunction-sections -D_FILE_OFFSET_BITS=64 -D__STDC_CONSTANT_MACROS -D__STDC_FORMAT_MACROS -pthread -pipe -fno-exceptions -fno-rtti -fdiagnostics-color -Wall -Wextra -Wno-unused-parameter -Wextra-semi -Wundef -std=c++23 -Wno-redundant-move -Wno-restrict -Wno-deprecated-copy -Wno-implicit-fallthrough -Wno-redundant-move -Wno-unused-variable -Wno-format -Wno-strict-aliasing -Wno-cast-function-type -c ../sources/gn-0+git/src/gn/ffi/scope.cc -o src/gn/ffi/scope.o
FAILED: [code=1] src/gn/ffi/scope.o
g++ -MMD -MF src/gn/ffi/scope.o.d -I../sources/gn-0+git/src -I../sources/gn-0+git/src/gn/starlark/vendor/cxx/include -I. -isystemTOPDIR/tmp/work/x86_64-linux/gn-native/0+git/recipe-sysroot-native/usr/include -O2 -pipe -Wno-error=maybe-uninitialized -isystemTOPDIR/tmp/work/x86_64-linux/gn-native/0+git/recipe-sysroot-native/usr/include -O2 -pipe -fvisibility-inlines-hidden -DNDEBUG -O3 -g -fdata-sections -ffunction-sections -D_FILE_OFFSET_BITS=64 -D__STDC_CONSTANT_MACROS -D__STDC_FORMAT_MACROS -pthread -pipe -fno-exceptions -fno-rtti -fdiagnostics-color -Wall -Wextra -Wno-unused-parameter -Wextra-semi -Wundef -std=c++23 -Wno-redundant-move -Wno-restrict -Wno-deprecated-copy -Wno-implicit-fallthrough -Wno-redundant-move -Wno-unused-variable -Wno-format -Wno-strict-aliasing -Wno-cast-function-type -c ../sources/gn-0+git/src/gn/ffi/scope.cc -o src/gn/ffi/scope.o
In file included from ../sources/gn-0+git/src/gn/ffi/bridge.h:4,
from ../sources/gn-0+git/src/gn/ffi/scope.cc:8:
../sources/gn-0+git/src/gn/err.h:8:10: fatal error: expected: No such file or directory
8 | #include <expected>
| ^~~~~~~~~~
compilation terminated.
[76/216] g++ -MMD -MF src/base/files/file.o.d -I../sources/gn-0+git/src -I../sources/gn-0+git/src/gn/starlark/vendor/cxx/include -I. -isystemTOPDIR/tmp/work/x86_64-linux/gn-native/0+git/recipe-sysroot-native/usr/include -O2 -pipe -Wno-error=maybe-uninitialized -isystemTOPDIR/tmp/work/x86_64-linux/gn-native/0+git/recipe-sysroot-native/usr/include -O2 -pipe -fvisibility-inlines-hidden -DNDEBUG -O3 -g -fdata-sections -ffunction-sections -D_FILE_OFFSET_BITS=64 -D__STDC_CONSTANT_MACROS -D__STDC_FORMAT_MACROS -pthread -pipe -fno-exceptions -fno-rtti -fdiagnostics-color -Wall -Wextra -Wno-unused-parameter -Wextra-semi -Wundef -std=c++23 -Wno-redundant-move -Wno-restrict -Wno-deprecated-copy -Wno-implicit-fallthrough -Wno-redundant-move -Wno-unused-variable -Wno-format -Wno-strict-aliasing -Wno-cast-function-type -c ../sources/gn-0+git/src/base/files/file.cc -o src/base/files/file.o
[77/216] g++ -MMD -MF src/gn/function_label_matches.o.d -I../sources/gn-0+git/src -I../sources/gn-0+git/src/gn/starlark/vendor/cxx/include -I. -isystemTOPDIR/tmp/work/x86_64-linux/gn-native/0+git/recipe-sysroot-native/usr/include -O2 -pipe -Wno-error=maybe-uninitialized -isystemTOPDIR/tmp/work/x86_64-linux/gn-native/0+git/recipe-sysroot-native/usr/include -O2 -pipe -fvisibility-inlines-hidden -DNDEBUG -O3 -g -fdata-sections -ffunction-sections -D_FILE_OFFSET_BITS=64 -D__STDC_CONSTANT_MACROS -D__STDC_FORMAT_MACROS -pthread -pipe -fno-exceptions -fno-rtti -fdiagnostics-color -Wall -Wextra -Wno-unused-parameter -Wextra-semi -Wundef -std=c++23 -Wno-redundant-move -Wno-restrict -Wno-deprecated-copy -Wno-implicit-fallthrough -Wno-redundant-move -Wno-unused-variable -Wno-format -Wno-strict-aliasing -Wno-cast-function-type -c ../sources/gn-0+git/src/gn/function_label_matches.cc -o src/gn/function_label_matches.o
FAILED: [code=1] src/gn/function_label_matches.o
g++ -MMD -MF src/gn/function_label_matches.o.d -I../sources/gn-0+git/src -I../sources/gn-0+git/src/gn/starlark/vendor/cxx/include -I. -isystemTOPDIR/tmp/work/x86_64-linux/gn-native/0+git/recipe-sysroot-native/usr/include -O2 -pipe -Wno-error=maybe-uninitialized -isystemTOPDIR/tmp/work/x86_64-linux/gn-native/0+git/recipe-sysroot-native/usr/include -O2 -pipe -fvisibility-inlines-hidden -DNDEBUG -O3 -g -fdata-sections -ffunction-sections -D_FILE_OFFSET_BITS=64 -D__STDC_CONSTANT_MACROS -D__STDC_FORMAT_MACROS -pthread -pipe -fno-exceptions -fno-rtti -fdiagnostics-color -Wall -Wextra -Wno-unused-parameter -Wextra-semi -Wundef -std=c++23 -Wno-redundant-move -Wno-restrict -Wno-deprecated-copy -Wno-implicit-fallthrough -Wno-redundant-move -Wno-unused-variable -Wno-format -Wno-strict-aliasing -Wno-cast-function-type -c ../sources/gn-0+git/src/gn/function_label_matches.cc -o src/gn/function_label_matches.o
In file included from ../sources/gn-0+git/src/gn/scope.h:19,
from ../sources/gn-0+git/src/gn/args.h:15,
from ../sources/gn-0+git/src/gn/build_settings.h:15,
from ../sources/gn-0+git/src/gn/function_label_matches.cc:7:
../sources/gn-0+git/src/gn/err.h:8:10: fatal error: expected: No such file or directory
8 | #include <expected>
| ^~~~~~~~~~
compilation terminated.
[78/216] g++ -MMD -MF src/base/strings/utf_string_conversion_utils.o.d -I../sources/gn-0+git/src -I../sources/gn-0+git/src/gn/starlark/vendor/cxx/include -I. -isystemTOPDIR/tmp/work/x86_64-linux/gn-native/0+git/recipe-sysroot-native/usr/include -O2 -pipe -Wno-error=maybe-uninitialized -isystemTOPDIR/tmp/work/x86_64-linux/gn-native/0+git/recipe-sysroot-native/usr/include -O2 -pipe -fvisibility-inlines-hidden -DNDEBUG -O3 -g -fdata-sections -ffunction-sections -D_FILE_OFFSET_BITS=64 -D__STDC_CONSTANT_MACROS -D__STDC_FORMAT_MACROS -pthread -pipe -fno-exceptions -fno-rtti -fdiagnostics-color -Wall -Wextra -Wno-unused-parameter -Wextra-semi -Wundef -std=c++23 -Wno-redundant-move -Wno-restrict -Wno-deprecated-copy -Wno-implicit-fallthrough -Wno-redundant-move -Wno-unused-variable -Wno-format -Wno-strict-aliasing -Wno-cast-function-type -c ../sources/gn-0+git/src/base/strings/utf_string_conversion_utils.cc -o src/base/strings/utf_string_conversion_utils.o
[79/216] g++ -MMD -MF src/gn/function_process_file_template.o.d -I../sources/gn-0+git/src -I../sources/gn-0+git/src/gn/starlark/vendor/cxx/include -I. -isystemTOPDIR/tmp/work/x86_64-linux/gn-native/0+git/recipe-sysroot-native/usr/include -O2 -pipe -Wno-error=maybe-uninitialized -isystemTOPDIR/tmp/work/x86_64-linux/gn-native/0+git/recipe-sysroot-native/usr/include -O2 -pipe -fvisibility-inlines-hidden -DNDEBUG -O3 -g -fdata-sections -ffunction-sections -D_FILE_OFFSET_BITS=64 -D__STDC_CONSTANT_MACROS -D__STDC_FORMAT_MACROS -pthread -pipe -fno-exceptions -fno-rtti -fdiagnostics-color -Wall -Wextra -Wno-unused-parameter -Wextra-semi -Wundef -std=c++23 -Wno-redundant-move -Wno-restrict -Wno-deprecated-copy -Wno-implicit-fallthrough -Wno-redundant-move -Wno-unused-variable -Wno-format -Wno-strict-aliasing -Wno-cast-function-type -c ../sources/gn-0+git/src/gn/function_process_file_template.cc -o src/gn/function_process_file_template.o
FAILED: [code=1] src/gn/function_process_file_template.o
g++ -MMD -MF src/gn/function_process_file_template.o.d -I../sources/gn-0+git/src -I../sources/gn-0+git/src/gn/starlark/vendor/cxx/include -I. -isystemTOPDIR/tmp/work/x86_64-linux/gn-native/0+git/recipe-sysroot-native/usr/include -O2 -pipe -Wno-error=maybe-uninitialized -isystemTOPDIR/tmp/work/x86_64-linux/gn-native/0+git/recipe-sysroot-native/usr/include -O2 -pipe -fvisibility-inlines-hidden -DNDEBUG -O3 -g -fdata-sections -ffunction-sections -D_FILE_OFFSET_BITS=64 -D__STDC_CONSTANT_MACROS -D__STDC_FORMAT_MACROS -pthread -pipe -fno-exceptions -fno-rtti -fdiagnostics-color -Wall -Wextra -Wno-unused-parameter -Wextra-semi -Wundef -std=c++23 -Wno-redundant-move -Wno-restrict -Wno-deprecated-copy -Wno-implicit-fallthrough -Wno-redundant-move -Wno-unused-variable -Wno-format -Wno-strict-aliasing -Wno-cast-function-type -c ../sources/gn-0+git/src/gn/function_process_file_template.cc -o src/gn/function_process_file_template.o
In file included from ../sources/gn-0+git/src/gn/parse_tree.h:17,
from ../sources/gn-0+git/src/gn/function_process_file_template.cc:7:
../sources/gn-0+git/src/gn/err.h:8:10: fatal error: expected: No such file or directory
8 | #include <expected>
| ^~~~~~~~~~
compilation terminated.
[80/216] g++ -MMD -MF src/gn/function_path_exists.o.d -I../sources/gn-0+git/src -I../sources/gn-0+git/src/gn/starlark/vendor/cxx/include -I. -isystemTOPDIR/tmp/work/x86_64-linux/gn-native/0+git/recipe-sysroot-native/usr/include -O2 -pipe -Wno-error=maybe-uninitialized -isystemTOPDIR/tmp/work/x86_64-linux/gn-native/0+git/recipe-sysroot-native/usr/include -O2 -pipe -fvisibility-inlines-hidden -DNDEBUG -O3 -g -fdata-sections -ffunction-sections -D_FILE_OFFSET_BITS=64 -D__STDC_CONSTANT_MACROS -D__STDC_FORMAT_MACROS -pthread -pipe -fno-exceptions -fno-rtti -fdiagnostics-color -Wall -Wextra -Wno-unused-parameter -Wextra-semi -Wundef -std=c++23 -Wno-redundant-move -Wno-restrict -Wno-deprecated-copy -Wno-implicit-fallthrough -Wno-redundant-move -Wno-unused-variable -Wno-format -Wno-strict-aliasing -Wno-cast-function-type -c ../sources/gn-0+git/src/gn/function_path_exists.cc -o src/gn/function_path_exists.o
FAILED: [code=1] src/gn/function_path_exists.o
g++ -MMD -MF src/gn/function_path_exists.o.d -I../sources/gn-0+git/src -I../sources/gn-0+git/src/gn/starlark/vendor/cxx/include -I. -isystemTOPDIR/tmp/work/x86_64-linux/gn-native/0+git/recipe-sysroot-native/usr/include -O2 -pipe -Wno-error=maybe-uninitialized -isystemTOPDIR/tmp/work/x86_64-linux/gn-native/0+git/recipe-sysroot-native/usr/include -O2 -pipe -fvisibility-inlines-hidden -DNDEBUG -O3 -g -fdata-sections -ffunction-sections -D_FILE_OFFSET_BITS=64 -D__STDC_CONSTANT_MACROS -D__STDC_FORMAT_MACROS -pthread -pipe -fno-exceptions -fno-rtti -fdiagnostics-color -Wall -Wextra -Wno-unused-parameter -Wextra-semi -Wundef -std=c++23 -Wno-redundant-move -Wno-restrict -Wno-deprecated-copy -Wno-implicit-fallthrough -Wno-redundant-move -Wno-unused-variable -Wno-format -Wno-strict-aliasing -Wno-cast-function-type -c ../sources/gn-0+git/src/gn/function_path_exists.cc -o src/gn/function_path_exists.o
In file included from ../sources/gn-0+git/src/gn/scope.h:19,
from ../sources/gn-0+git/src/gn/args.h:15,
from ../sources/gn-0+git/src/gn/build_settings.h:15,
from ../sources/gn-0+git/src/gn/function_path_exists.cc:8:
../sources/gn-0+git/src/gn/err.h:8:10: fatal error: expected: No such file or directory
8 | #include <expected>
| ^~~~~~~~~~
compilation terminated.
[81/216] g++ -MMD -MF src/gn/function_read_file.o.d -I../sources/gn-0+git/src -I../sources/gn-0+git/src/gn/starlark/vendor/cxx/include -I. -isystemTOPDIR/tmp/work/x86_64-linux/gn-native/0+git/recipe-sysroot-native/usr/include -O2 -pipe -Wno-error=maybe-uninitialized -isystemTOPDIR/tmp/work/x86_64-linux/gn-native/0+git/recipe-sysroot-native/usr/include -O2 -pipe -fvisibility-inlines-hidden -DNDEBUG -O3 -g -fdata-sections -ffunction-sections -D_FILE_OFFSET_BITS=64 -D__STDC_CONSTANT_MACROS -D__STDC_FORMAT_MACROS -pthread -pipe -fno-exceptions -fno-rtti -fdiagnostics-color -Wall -Wextra -Wno-unused-parameter -Wextra-semi -Wundef -std=c++23 -Wno-redundant-move -Wno-restrict -Wno-deprecated-copy -Wno-implicit-fallthrough -Wno-redundant-move -Wno-unused-variable -Wno-format -Wno-strict-aliasing -Wno-cast-function-type -c ../sources/gn-0+git/src/gn/function_read_file.cc -o src/gn/function_read_file.o
FAILED: [code=1] src/gn/function_read_file.o
g++ -MMD -MF src/gn/function_read_file.o.d -I../sources/gn-0+git/src -I../sources/gn-0+git/src/gn/starlark/vendor/cxx/include -I. -isystemTOPDIR/tmp/work/x86_64-linux/gn-native/0+git/recipe-sysroot-native/usr/include -O2 -pipe -Wno-error=maybe-uninitialized -isystemTOPDIR/tmp/work/x86_64-linux/gn-native/0+git/recipe-sysroot-native/usr/include -O2 -pipe -fvisibility-inlines-hidden -DNDEBUG -O3 -g -fdata-sections -ffunction-sections -D_FILE_OFFSET_BITS=64 -D__STDC_CONSTANT_MACROS -D__STDC_FORMAT_MACROS -pthread -pipe -fno-exceptions -fno-rtti -fdiagnostics-color -Wall -Wextra -Wno-unused-parameter -Wextra-semi -Wundef -std=c++23 -Wno-redundant-move -Wno-restrict -Wno-deprecated-copy -Wno-implicit-fallthrough -Wno-redundant-move -Wno-unused-variable -Wno-format -Wno-strict-aliasing -Wno-cast-function-type -c ../sources/gn-0+git/src/gn/function_read_file.cc -o src/gn/function_read_file.o
In file included from ../sources/gn-0+git/src/gn/function_read_file.cc:6:
../sources/gn-0+git/src/gn/err.h:8:10: fatal error: expected: No such file or directory
8 | #include <expected>
| ^~~~~~~~~~
compilation terminated.
[82/216] g++ -MMD -MF src/gn/function_template.o.d -I../sources/gn-0+git/src -I../sources/gn-0+git/src/gn/starlark/vendor/cxx/include -I. -isystemTOPDIR/tmp/work/x86_64-linux/gn-native/0+git/recipe-sysroot-native/usr/include -O2 -pipe -Wno-error=maybe-uninitialized -isystemTOPDIR/tmp/work/x86_64-linux/gn-native/0+git/recipe-sysroot-native/usr/include -O2 -pipe -fvisibility-inlines-hidden -DNDEBUG -O3 -g -fdata-sections -ffunction-sections -D_FILE_OFFSET_BITS=64 -D__STDC_CONSTANT_MACROS -D__STDC_FORMAT_MACROS -pthread -pipe -fno-exceptions -fno-rtti -fdiagnostics-color -Wall -Wextra -Wno-unused-parameter -Wextra-semi -Wundef -std=c++23 -Wno-redundant-move -Wno-restrict -Wno-deprecated-copy -Wno-implicit-fallthrough -Wno-redundant-move -Wno-unused-variable -Wno-format -Wno-strict-aliasing -Wno-cast-function-type -c ../sources/gn-0+git/src/gn/function_template.cc -o src/gn/function_template.o
FAILED: [code=1] src/gn/function_template.o
g++ -MMD -MF src/gn/function_template.o.d -I../sources/gn-0+git/src -I../sources/gn-0+git/src/gn/starlark/vendor/cxx/include -I. -isystemTOPDIR/tmp/work/x86_64-linux/gn-native/0+git/recipe-sysroot-native/usr/include -O2 -pipe -Wno-error=maybe-uninitialized -isystemTOPDIR/tmp/work/x86_64-linux/gn-native/0+git/recipe-sysroot-native/usr/include -O2 -pipe -fvisibility-inlines-hidden -DNDEBUG -O3 -g -fdata-sections -ffunction-sections -D_FILE_OFFSET_BITS=64 -D__STDC_CONSTANT_MACROS -D__STDC_FORMAT_MACROS -pthread -pipe -fno-exceptions -fno-rtti -fdiagnostics-color -Wall -Wextra -Wno-unused-parameter -Wextra-semi -Wundef -std=c++23 -Wno-redundant-move -Wno-restrict -Wno-deprecated-copy -Wno-implicit-fallthrough -Wno-redundant-move -Wno-unused-variable -Wno-format -Wno-strict-aliasing -Wno-cast-function-type -c ../sources/gn-0+git/src/gn/function_template.cc -o src/gn/function_template.o
In file included from ../sources/gn-0+git/src/gn/parse_tree.h:17,
from ../sources/gn-0+git/src/gn/function_template.cc:7:
../sources/gn-0+git/src/gn/err.h:8:10: fatal error: expected: No such file or directory
8 | #include <expected>
| ^~~~~~~~~~
compilation terminated.
[83/216] g++ -MMD -MF src/gn/function_rebase_path.o.d -I../sources/gn-0+git/src -I../sources/gn-0+git/src/gn/starlark/vendor/cxx/include -I. -isystemTOPDIR/tmp/work/x86_64-linux/gn-native/0+git/recipe-sysroot-native/usr/include -O2 -pipe -Wno-error=maybe-uninitialized -isystemTOPDIR/tmp/work/x86_64-linux/gn-native/0+git/recipe-sysroot-native/usr/include -O2 -pipe -fvisibility-inlines-hidden -DNDEBUG -O3 -g -fdata-sections -ffunction-sections -D_FILE_OFFSET_BITS=64 -D__STDC_CONSTANT_MACROS -D__STDC_FORMAT_MACROS -pthread -pipe -fno-exceptions -fno-rtti -fdiagnostics-color -Wall -Wextra -Wno-unused-parameter -Wextra-semi -Wundef -std=c++23 -Wno-redundant-move -Wno-restrict -Wno-deprecated-copy -Wno-implicit-fallthrough -Wno-redundant-move -Wno-unused-variable -Wno-format -Wno-strict-aliasing -Wno-cast-function-type -c ../sources/gn-0+git/src/gn/function_rebase_path.cc -o src/gn/function_rebase_path.o
FAILED: [code=1] src/gn/function_rebase_path.o
g++ -MMD -MF src/gn/function_rebase_path.o.d -I../sources/gn-0+git/src -I../sources/gn-0+git/src/gn/starlark/vendor/cxx/include -I. -isystemTOPDIR/tmp/work/x86_64-linux/gn-native/0+git/recipe-sysroot-native/usr/include -O2 -pipe -Wno-error=maybe-uninitialized -isystemTOPDIR/tmp/work/x86_64-linux/gn-native/0+git/recipe-sysroot-native/usr/include -O2 -pipe -fvisibility-inlines-hidden -DNDEBUG -O3 -g -fdata-sections -ffunction-sections -D_FILE_OFFSET_BITS=64 -D__STDC_CONSTANT_MACROS -D__STDC_FORMAT_MACROS -pthread -pipe -fno-exceptions -fno-rtti -fdiagnostics-color -Wall -Wextra -Wno-unused-parameter -Wextra-semi -Wundef -std=c++23 -Wno-redundant-move -Wno-restrict -Wno-deprecated-copy -Wno-implicit-fallthrough -Wno-redundant-move -Wno-unused-variable -Wno-format -Wno-strict-aliasing -Wno-cast-function-type -c ../sources/gn-0+git/src/gn/function_rebase_path.cc -o src/gn/function_rebase_path.o
In file included from ../sources/gn-0+git/src/gn/scope.h:19,
from ../sources/gn-0+git/src/gn/args.h:15,
from ../sources/gn-0+git/src/gn/build_settings.h:15,
from ../sources/gn-0+git/src/gn/function_rebase_path.cc:9:
../sources/gn-0+git/src/gn/err.h:8:10: fatal error: expected: No such file or directory
8 | #include <expected>
| ^~~~~~~~~~
compilation terminated.
[84/216] g++ -MMD -MF src/gn/function_toolchain.o.d -I../sources/gn-0+git/src -I../sources/gn-0+git/src/gn/starlark/vendor/cxx/include -I. -isystemTOPDIR/tmp/work/x86_64-linux/gn-native/0+git/recipe-sysroot-native/usr/include -O2 -pipe -Wno-error=maybe-uninitialized -isystemTOPDIR/tmp/work/x86_64-linux/gn-native/0+git/recipe-sysroot-native/usr/include -O2 -pipe -fvisibility-inlines-hidden -DNDEBUG -O3 -g -fdata-sections -ffunction-sections -D_FILE_OFFSET_BITS=64 -D__STDC_CONSTANT_MACROS -D__STDC_FORMAT_MACROS -pthread -pipe -fno-exceptions -fno-rtti -fdiagnostics-color -Wall -Wextra -Wno-unused-parameter -Wextra-semi -Wundef -std=c++23 -Wno-redundant-move -Wno-restrict -Wno-deprecated-copy -Wno-implicit-fallthrough -Wno-redundant-move -Wno-unused-variable -Wno-format -Wno-strict-aliasing -Wno-cast-function-type -c ../sources/gn-0+git/src/gn/function_toolchain.cc -o src/gn/function_toolchain.o
FAILED: [code=1] src/gn/function_toolchain.o
g++ -MMD -MF src/gn/function_toolchain.o.d -I../sources/gn-0+git/src -I../sources/gn-0+git/src/gn/starlark/vendor/cxx/include -I. -isystemTOPDIR/tmp/work/x86_64-linux/gn-native/0+git/recipe-sysroot-native/usr/include -O2 -pipe -Wno-error=maybe-uninitialized -isystemTOPDIR/tmp/work/x86_64-linux/gn-native/0+git/recipe-sysroot-native/usr/include -O2 -pipe -fvisibility-inlines-hidden -DNDEBUG -O3 -g -fdata-sections -ffunction-sections -D_FILE_OFFSET_BITS=64 -D__STDC_CONSTANT_MACROS -D__STDC_FORMAT_MACROS -pthread -pipe -fno-exceptions -fno-rtti -fdiagnostics-color -Wall -Wextra -Wno-unused-parameter -Wextra-semi -Wundef -std=c++23 -Wno-redundant-move -Wno-restrict -Wno-deprecated-copy -Wno-implicit-fallthrough -Wno-redundant-move -Wno-unused-variable -Wno-format -Wno-strict-aliasing -Wno-cast-function-type -c ../sources/gn-0+git/src/gn/function_toolchain.cc -o src/gn/function_toolchain.o
In file included from ../sources/gn-0+git/src/gn/scope.h:19,
from ../sources/gn-0+git/src/gn/c_tool.h:13,
from ../sources/gn-0+git/src/gn/function_toolchain.cc:10:
../sources/gn-0+git/src/gn/err.h:8:10: fatal error: expected: No such file or directory
8 | #include <expected>
| ^~~~~~~~~~
compilation terminated.
[85/216] g++ -MMD -MF src/base/files/scoped_temp_dir.o.d -I../sources/gn-0+git/src -I../sources/gn-0+git/src/gn/starlark/vendor/cxx/include -I. -isystemTOPDIR/tmp/work/x86_64-linux/gn-native/0+git/recipe-sysroot-native/usr/include -O2 -pipe -Wno-error=maybe-uninitialized -isystemTOPDIR/tmp/work/x86_64-linux/gn-native/0+git/recipe-sysroot-native/usr/include -O2 -pipe -fvisibility-inlines-hidden -DNDEBUG -O3 -g -fdata-sections -ffunction-sections -D_FILE_OFFSET_BITS=64 -D__STDC_CONSTANT_MACROS -D__STDC_FORMAT_MACROS -pthread -pipe -fno-exceptions -fno-rtti -fdiagnostics-color -Wall -Wextra -Wno-unused-parameter -Wextra-semi -Wundef -std=c++23 -Wno-redundant-move -Wno-restrict -Wno-deprecated-copy -Wno-implicit-fallthrough -Wno-redundant-move -Wno-unused-variable -Wno-format -Wno-strict-aliasing -Wno-cast-function-type -c ../sources/gn-0+git/src/base/files/scoped_temp_dir.cc -o src/base/files/scoped_temp_dir.o
[86/216] g++ -MMD -MF src/gn/function_set_default_toolchain.o.d -I../sources/gn-0+git/src -I../sources/gn-0+git/src/gn/starlark/vendor/cxx/include -I. -isystemTOPDIR/tmp/work/x86_64-linux/gn-native/0+git/recipe-sysroot-native/usr/include -O2 -pipe -Wno-error=maybe-uninitialized -isystemTOPDIR/tmp/work/x86_64-linux/gn-native/0+git/recipe-sysroot-native/usr/include -O2 -pipe -fvisibility-inlines-hidden -DNDEBUG -O3 -g -fdata-sections -ffunction-sections -D_FILE_OFFSET_BITS=64 -D__STDC_CONSTANT_MACROS -D__STDC_FORMAT_MACROS -pthread -pipe -fno-exceptions -fno-rtti -fdiagnostics-color -Wall -Wextra -Wno-unused-parameter -Wextra-semi -Wundef -std=c++23 -Wno-redundant-move -Wno-restrict -Wno-deprecated-copy -Wno-implicit-fallthrough -Wno-redundant-move -Wno-unused-variable -Wno-format -Wno-strict-aliasing -Wno-cast-function-type -c ../sources/gn-0+git/src/gn/function_set_default_toolchain.cc -o src/gn/function_set_default_toolchain.o
FAILED: [code=1] src/gn/function_set_default_toolchain.o
g++ -MMD -MF src/gn/function_set_default_toolchain.o.d -I../sources/gn-0+git/src -I../sources/gn-0+git/src/gn/starlark/vendor/cxx/include -I. -isystemTOPDIR/tmp/work/x86_64-linux/gn-native/0+git/recipe-sysroot-native/usr/include -O2 -pipe -Wno-error=maybe-uninitialized -isystemTOPDIR/tmp/work/x86_64-linux/gn-native/0+git/recipe-sysroot-native/usr/include -O2 -pipe -fvisibility-inlines-hidden -DNDEBUG -O3 -g -fdata-sections -ffunction-sections -D_FILE_OFFSET_BITS=64 -D__STDC_CONSTANT_MACROS -D__STDC_FORMAT_MACROS -pthread -pipe -fno-exceptions -fno-rtti -fdiagnostics-color -Wall -Wextra -Wno-unused-parameter -Wextra-semi -Wundef -std=c++23 -Wno-redundant-move -Wno-restrict -Wno-deprecated-copy -Wno-implicit-fallthrough -Wno-redundant-move -Wno-unused-variable -Wno-format -Wno-strict-aliasing -Wno-cast-function-type -c ../sources/gn-0+git/src/gn/function_set_default_toolchain.cc -o src/gn/function_set_default_toolchain.o
In file included from ../sources/gn-0+git/src/gn/scope.h:19,
from ../sources/gn-0+git/src/gn/args.h:15,
from ../sources/gn-0+git/src/gn/build_settings.h:15,
from ../sources/gn-0+git/src/gn/function_set_default_toolchain.cc:5:
../sources/gn-0+git/src/gn/err.h:8:10: fatal error: expected: No such file or directory
8 | #include <expected>
| ^~~~~~~~~~
compilation terminated.
[87/216] g++ -MMD -MF src/gn/string_atom.o.d -I../sources/gn-0+git/src -I../sources/gn-0+git/src/gn/starlark/vendor/cxx/include -I. -isystemTOPDIR/tmp/work/x86_64-linux/gn-native/0+git/recipe-sysroot-native/usr/include -O2 -pipe -Wno-error=maybe-uninitialized -isystemTOPDIR/tmp/work/x86_64-linux/gn-native/0+git/recipe-sysroot-native/usr/include -O2 -pipe -fvisibility-inlines-hidden -DNDEBUG -O3 -g -fdata-sections -ffunction-sections -D_FILE_OFFSET_BITS=64 -D__STDC_CONSTANT_MACROS -D__STDC_FORMAT_MACROS -pthread -pipe -fno-exceptions -fno-rtti -fdiagnostics-color -Wall -Wextra -Wno-unused-parameter -Wextra-semi -Wundef -std=c++23 -Wno-redundant-move -Wno-restrict -Wno-deprecated-copy -Wno-implicit-fallthrough -Wno-redundant-move -Wno-unused-variable -Wno-format -Wno-strict-aliasing -Wno-cast-function-type -c ../sources/gn-0+git/src/gn/string_atom.cc -o src/gn/string_atom.o
[88/216] g++ -MMD -MF src/base/files/file_enumerator_posix.o.d -I../sources/gn-0+git/src -I../sources/gn-0+git/src/gn/starlark/vendor/cxx/include -I. -isystemTOPDIR/tmp/work/x86_64-linux/gn-native/0+git/recipe-sysroot-native/usr/include -O2 -pipe -Wno-error=maybe-uninitialized -isystemTOPDIR/tmp/work/x86_64-linux/gn-native/0+git/recipe-sysroot-native/usr/include -O2 -pipe -fvisibility-inlines-hidden -DNDEBUG -O3 -g -fdata-sections -ffunction-sections -D_FILE_OFFSET_BITS=64 -D__STDC_CONSTANT_MACROS -D__STDC_FORMAT_MACROS -pthread -pipe -fno-exceptions -fno-rtti -fdiagnostics-color -Wall -Wextra -Wno-unused-parameter -Wextra-semi -Wundef -std=c++23 -Wno-redundant-move -Wno-restrict -Wno-deprecated-copy -Wno-implicit-fallthrough -Wno-redundant-move -Wno-unused-variable -Wno-format -Wno-strict-aliasing -Wno-cast-function-type -c ../sources/gn-0+git/src/base/files/file_enumerator_posix.cc -o src/base/files/file_enumerator_posix.o
[89/216] g++ -MMD -MF src/base/environment.o.d -I../sources/gn-0+git/src -I../sources/gn-0+git/src/gn/starlark/vendor/cxx/include -I. -isystemTOPDIR/tmp/work/x86_64-linux/gn-native/0+git/recipe-sysroot-native/usr/include -O2 -pipe -Wno-error=maybe-uninitialized -isystemTOPDIR/tmp/work/x86_64-linux/gn-native/0+git/recipe-sysroot-native/usr/include -O2 -pipe -fvisibility-inlines-hidden -DNDEBUG -O3 -g -fdata-sections -ffunction-sections -D_FILE_OFFSET_BITS=64 -D__STDC_CONSTANT_MACROS -D__STDC_FORMAT_MACROS -pthread -pipe -fno-exceptions -fno-rtti -fdiagnostics-color -Wall -Wextra -Wno-unused-parameter -Wextra-semi -Wundef -std=c++23 -Wno-redundant-move -Wno-restrict -Wno-deprecated-copy -Wno-implicit-fallthrough -Wno-redundant-move -Wno-unused-variable -Wno-format -Wno-strict-aliasing -Wno-cast-function-type -c ../sources/gn-0+git/src/base/environment.cc -o src/base/environment.o
[90/216] g++ -MMD -MF src/base/files/file_posix.o.d -I../sources/gn-0+git/src -I../sources/gn-0+git/src/gn/starlark/vendor/cxx/include -I. -isystemTOPDIR/tmp/work/x86_64-linux/gn-native/0+git/recipe-sysroot-native/usr/include -O2 -pipe -Wno-error=maybe-uninitialized -isystemTOPDIR/tmp/work/x86_64-linux/gn-native/0+git/recipe-sysroot-native/usr/include -O2 -pipe -fvisibility-inlines-hidden -DNDEBUG -O3 -g -fdata-sections -ffunction-sections -D_FILE_OFFSET_BITS=64 -D__STDC_CONSTANT_MACROS -D__STDC_FORMAT_MACROS -pthread -pipe -fno-exceptions -fno-rtti -fdiagnostics-color -Wall -Wextra -Wno-unused-parameter -Wextra-semi -Wundef -std=c++23 -Wno-redundant-move -Wno-restrict -Wno-deprecated-copy -Wno-implicit-fallthrough -Wno-redundant-move -Wno-unused-variable -Wno-format -Wno-strict-aliasing -Wno-cast-function-type -c ../sources/gn-0+git/src/base/files/file_posix.cc -o src/base/files/file_posix.o
[91/216] g++ -MMD -MF src/base/strings/stringprintf.o.d -I../sources/gn-0+git/src -I../sources/gn-0+git/src/gn/starlark/vendor/cxx/include -I. -isystemTOPDIR/tmp/work/x86_64-linux/gn-native/0+git/recipe-sysroot-native/usr/include -O2 -pipe -Wno-error=maybe-uninitialized -isystemTOPDIR/tmp/work/x86_64-linux/gn-native/0+git/recipe-sysroot-native/usr/include -O2 -pipe -fvisibility-inlines-hidden -DNDEBUG -O3 -g -fdata-sections -ffunction-sections -D_FILE_OFFSET_BITS=64 -D__STDC_CONSTANT_MACROS -D__STDC_FORMAT_MACROS -pthread -pipe -fno-exceptions -fno-rtti -fdiagnostics-color -Wall -Wextra -Wno-unused-parameter -Wextra-semi -Wundef -std=c++23 -Wno-redundant-move -Wno-restrict -Wno-deprecated-copy -Wno-implicit-fallthrough -Wno-redundant-move -Wno-unused-variable -Wno-format -Wno-strict-aliasing -Wno-cast-function-type -c ../sources/gn-0+git/src/base/strings/stringprintf.cc -o src/base/strings/stringprintf.o
[92/216] g++ -MMD -MF src/base/value_iterators.o.d -I../sources/gn-0+git/src -I../sources/gn-0+git/src/gn/starlark/vendor/cxx/include -I. -isystemTOPDIR/tmp/work/x86_64-linux/gn-native/0+git/recipe-sysroot-native/usr/include -O2 -pipe -Wno-error=maybe-uninitialized -isystemTOPDIR/tmp/work/x86_64-linux/gn-native/0+git/recipe-sysroot-native/usr/include -O2 -pipe -fvisibility-inlines-hidden -DNDEBUG -O3 -g -fdata-sections -ffunction-sections -D_FILE_OFFSET_BITS=64 -D__STDC_CONSTANT_MACROS -D__STDC_FORMAT_MACROS -pthread -pipe -fno-exceptions -fno-rtti -fdiagnostics-color -Wall -Wextra -Wno-unused-parameter -Wextra-semi -Wundef -std=c++23 -Wno-redundant-move -Wno-restrict -Wno-deprecated-copy -Wno-implicit-fallthrough -Wno-redundant-move -Wno-unused-variable -Wno-format -Wno-strict-aliasing -Wno-cast-function-type -c ../sources/gn-0+git/src/base/value_iterators.cc -o src/base/value_iterators.o
[93/216] g++ -MMD -MF src/base/json/json_reader.o.d -I../sources/gn-0+git/src -I../sources/gn-0+git/src/gn/starlark/vendor/cxx/include -I. -isystemTOPDIR/tmp/work/x86_64-linux/gn-native/0+git/recipe-sysroot-native/usr/include -O2 -pipe -Wno-error=maybe-uninitialized -isystemTOPDIR/tmp/work/x86_64-linux/gn-native/0+git/recipe-sysroot-native/usr/include -O2 -pipe -fvisibility-inlines-hidden -DNDEBUG -O3 -g -fdata-sections -ffunction-sections -D_FILE_OFFSET_BITS=64 -D__STDC_CONSTANT_MACROS -D__STDC_FORMAT_MACROS -pthread -pipe -fno-exceptions -fno-rtti -fdiagnostics-color -Wall -Wextra -Wno-unused-parameter -Wextra-semi -Wundef -std=c++23 -Wno-redundant-move -Wno-restrict -Wno-deprecated-copy -Wno-implicit-fallthrough -Wno-redundant-move -Wno-unused-variable -Wno-format -Wno-strict-aliasing -Wno-cast-function-type -c ../sources/gn-0+git/src/base/json/json_reader.cc -o src/base/json/json_reader.o
[94/216] g++ -MMD -MF src/base/strings/string_split.o.d -I../sources/gn-0+git/src -I../sources/gn-0+git/src/gn/starlark/vendor/cxx/include -I. -isystemTOPDIR/tmp/work/x86_64-linux/gn-native/0+git/recipe-sysroot-native/usr/include -O2 -pipe -Wno-error=maybe-uninitialized -isystemTOPDIR/tmp/work/x86_64-linux/gn-native/0+git/recipe-sysroot-native/usr/include -O2 -pipe -fvisibility-inlines-hidden -DNDEBUG -O3 -g -fdata-sections -ffunction-sections -D_FILE_OFFSET_BITS=64 -D__STDC_CONSTANT_MACROS -D__STDC_FORMAT_MACROS -pthread -pipe -fno-exceptions -fno-rtti -fdiagnostics-color -Wall -Wextra -Wno-unused-parameter -Wextra-semi -Wundef -std=c++23 -Wno-redundant-move -Wno-restrict -Wno-deprecated-copy -Wno-implicit-fallthrough -Wno-redundant-move -Wno-unused-variable -Wno-format -Wno-strict-aliasing -Wno-cast-function-type -c ../sources/gn-0+git/src/base/strings/string_split.cc -o src/base/strings/string_split.o
[95/216] g++ -MMD -MF src/gn/c_include_iterator.o.d -I../sources/gn-0+git/src -I../sources/gn-0+git/src/gn/starlark/vendor/cxx/include -I. -isystemTOPDIR/tmp/work/x86_64-linux/gn-native/0+git/recipe-sysroot-native/usr/include -O2 -pipe -Wno-error=maybe-uninitialized -isystemTOPDIR/tmp/work/x86_64-linux/gn-native/0+git/recipe-sysroot-native/usr/include -O2 -pipe -fvisibility-inlines-hidden -DNDEBUG -O3 -g -fdata-sections -ffunction-sections -D_FILE_OFFSET_BITS=64 -D__STDC_CONSTANT_MACROS -D__STDC_FORMAT_MACROS -pthread -pipe -fno-exceptions -fno-rtti -fdiagnostics-color -Wall -Wextra -Wno-unused-parameter -Wextra-semi -Wundef -std=c++23 -Wno-redundant-move -Wno-restrict -Wno-deprecated-copy -Wno-implicit-fallthrough -Wno-redundant-move -Wno-unused-variable -Wno-format -Wno-strict-aliasing -Wno-cast-function-type -c ../sources/gn-0+git/src/gn/c_include_iterator.cc -o src/gn/c_include_iterator.o
[96/216] g++ -MMD -MF src/base/json/json_writer.o.d -I../sources/gn-0+git/src -I../sources/gn-0+git/src/gn/starlark/vendor/cxx/include -I. -isystemTOPDIR/tmp/work/x86_64-linux/gn-native/0+git/recipe-sysroot-native/usr/include -O2 -pipe -Wno-error=maybe-uninitialized -isystemTOPDIR/tmp/work/x86_64-linux/gn-native/0+git/recipe-sysroot-native/usr/include -O2 -pipe -fvisibility-inlines-hidden -DNDEBUG -O3 -g -fdata-sections -ffunction-sections -D_FILE_OFFSET_BITS=64 -D__STDC_CONSTANT_MACROS -D__STDC_FORMAT_MACROS -pthread -pipe -fno-exceptions -fno-rtti -fdiagnostics-color -Wall -Wextra -Wno-unused-parameter -Wextra-semi -Wundef -std=c++23 -Wno-redundant-move -Wno-restrict -Wno-deprecated-copy -Wno-implicit-fallthrough -Wno-redundant-move -Wno-unused-variable -Wno-format -Wno-strict-aliasing -Wno-cast-function-type -c ../sources/gn-0+git/src/base/json/json_writer.cc -o src/base/json/json_writer.o
[97/216] g++ -MMD -MF src/base/strings/utf_string_conversions.o.d -I../sources/gn-0+git/src -I../sources/gn-0+git/src/gn/starlark/vendor/cxx/include -I. -isystemTOPDIR/tmp/work/x86_64-linux/gn-native/0+git/recipe-sysroot-native/usr/include -O2 -pipe -Wno-error=maybe-uninitialized -isystemTOPDIR/tmp/work/x86_64-linux/gn-native/0+git/recipe-sysroot-native/usr/include -O2 -pipe -fvisibility-inlines-hidden -DNDEBUG -O3 -g -fdata-sections -ffunction-sections -D_FILE_OFFSET_BITS=64 -D__STDC_CONSTANT_MACROS -D__STDC_FORMAT_MACROS -pthread -pipe -fno-exceptions -fno-rtti -fdiagnostics-color -Wall -Wextra -Wno-unused-parameter -Wextra-semi -Wundef -std=c++23 -Wno-redundant-move -Wno-restrict -Wno-deprecated-copy -Wno-implicit-fallthrough -Wno-redundant-move -Wno-unused-variable -Wno-format -Wno-strict-aliasing -Wno-cast-function-type -c ../sources/gn-0+git/src/base/strings/utf_string_conversions.cc -o src/base/strings/utf_string_conversions.o
[98/216] g++ -MMD -MF src/base/files/file_enumerator.o.d -I../sources/gn-0+git/src -I../sources/gn-0+git/src/gn/starlark/vendor/cxx/include -I. -isystemTOPDIR/tmp/work/x86_64-linux/gn-native/0+git/recipe-sysroot-native/usr/include -O2 -pipe -Wno-error=maybe-uninitialized -isystemTOPDIR/tmp/work/x86_64-linux/gn-native/0+git/recipe-sysroot-native/usr/include -O2 -pipe -fvisibility-inlines-hidden -DNDEBUG -O3 -g -fdata-sections -ffunction-sections -D_FILE_OFFSET_BITS=64 -D__STDC_CONSTANT_MACROS -D__STDC_FORMAT_MACROS -pthread -pipe -fno-exceptions -fno-rtti -fdiagnostics-color -Wall -Wextra -Wno-unused-parameter -Wextra-semi -Wundef -std=c++23 -Wno-redundant-move -Wno-restrict -Wno-deprecated-copy -Wno-implicit-fallthrough -Wno-redundant-move -Wno-unused-variable -Wno-format -Wno-strict-aliasing -Wno-cast-function-type -c ../sources/gn-0+git/src/base/files/file_enumerator.cc -o src/base/files/file_enumerator.o
[99/216] g++ -MMD -MF src/base/files/file_util.o.d -I../sources/gn-0+git/src -I../sources/gn-0+git/src/gn/starlark/vendor/cxx/include -I. -isystemTOPDIR/tmp/work/x86_64-linux/gn-native/0+git/recipe-sysroot-native/usr/include -O2 -pipe -Wno-error=maybe-uninitialized -isystemTOPDIR/tmp/work/x86_64-linux/gn-native/0+git/recipe-sysroot-native/usr/include -O2 -pipe -fvisibility-inlines-hidden -DNDEBUG -O3 -g -fdata-sections -ffunction-sections -D_FILE_OFFSET_BITS=64 -D__STDC_CONSTANT_MACROS -D__STDC_FORMAT_MACROS -pthread -pipe -fno-exceptions -fno-rtti -fdiagnostics-color -Wall -Wextra -Wno-unused-parameter -Wextra-semi -Wundef -std=c++23 -Wno-redundant-move -Wno-restrict -Wno-deprecated-copy -Wno-implicit-fallthrough -Wno-redundant-move -Wno-unused-variable -Wno-format -Wno-strict-aliasing -Wno-cast-function-type -c ../sources/gn-0+git/src/base/files/file_util.cc -o src/base/files/file_util.o
[100/216] g++ -MMD -MF src/base/strings/string_number_conversions.o.d -I../sources/gn-0+git/src -I../sources/gn-0+git/src/gn/starlark/vendor/cxx/include -I. -isystemTOPDIR/tmp/work/x86_64-linux/gn-native/0+git/recipe-sysroot-native/usr/include -O2 -pipe -Wno-error=maybe-uninitialized -isystemTOPDIR/tmp/work/x86_64-linux/gn-native/0+git/recipe-sysroot-native/usr/include -O2 -pipe -fvisibility-inlines-hidden -DNDEBUG -O3 -g -fdata-sections -ffunction-sections -D_FILE_OFFSET_BITS=64 -D__STDC_CONSTANT_MACROS -D__STDC_FORMAT_MACROS -pthread -pipe -fno-exceptions -fno-rtti -fdiagnostics-color -Wall -Wextra -Wno-unused-parameter -Wextra-semi -Wundef -std=c++23 -Wno-redundant-move -Wno-restrict -Wno-deprecated-copy -Wno-implicit-fallthrough -Wno-redundant-move -Wno-unused-variable -Wno-format -Wno-strict-aliasing -Wno-cast-function-type -c ../sources/gn-0+git/src/base/strings/string_number_conversions.cc -o src/base/strings/string_number_conversions.o
[101/216] g++ -MMD -MF src/gn/escape.o.d -I../sources/gn-0+git/src -I../sources/gn-0+git/src/gn/starlark/vendor/cxx/include -I. -isystemTOPDIR/tmp/work/x86_64-linux/gn-native/0+git/recipe-sysroot-native/usr/include -O2 -pipe -Wno-error=maybe-uninitialized -isystemTOPDIR/tmp/work/x86_64-linux/gn-native/0+git/recipe-sysroot-native/usr/include -O2 -pipe -fvisibility-inlines-hidden -DNDEBUG -O3 -g -fdata-sections -ffunction-sections -D_FILE_OFFSET_BITS=64 -D__STDC_CONSTANT_MACROS -D__STDC_FORMAT_MACROS -pthread -pipe -fno-exceptions -fno-rtti -fdiagnostics-color -Wall -Wextra -Wno-unused-parameter -Wextra-semi -Wundef -std=c++23 -Wno-redundant-move -Wno-restrict -Wno-deprecated-copy -Wno-implicit-fallthrough -Wno-redundant-move -Wno-unused-variable -Wno-format -Wno-strict-aliasing -Wno-cast-function-type -c ../sources/gn-0+git/src/gn/escape.cc -o src/gn/escape.o
[102/216] g++ -MMD -MF src/base/logging.o.d -I../sources/gn-0+git/src -I../sources/gn-0+git/src/gn/starlark/vendor/cxx/include -I. -isystemTOPDIR/tmp/work/x86_64-linux/gn-native/0+git/recipe-sysroot-native/usr/include -O2 -pipe -Wno-error=maybe-uninitialized -isystemTOPDIR/tmp/work/x86_64-linux/gn-native/0+git/recipe-sysroot-native/usr/include -O2 -pipe -fvisibility-inlines-hidden -DNDEBUG -O3 -g -fdata-sections -ffunction-sections -D_FILE_OFFSET_BITS=64 -D__STDC_CONSTANT_MACROS -D__STDC_FORMAT_MACROS -pthread -pipe -fno-exceptions -fno-rtti -fdiagnostics-color -Wall -Wextra -Wno-unused-parameter -Wextra-semi -Wundef -std=c++23 -Wno-redundant-move -Wno-restrict -Wno-deprecated-copy -Wno-implicit-fallthrough -Wno-redundant-move -Wno-unused-variable -Wno-format -Wno-strict-aliasing -Wno-cast-function-type -c ../sources/gn-0+git/src/base/logging.cc -o src/base/logging.o
[103/216] g++ -MMD -MF src/base/files/file_path.o.d -I../sources/gn-0+git/src -I../sources/gn-0+git/src/gn/starlark/vendor/cxx/include -I. -isystemTOPDIR/tmp/work/x86_64-linux/gn-native/0+git/recipe-sysroot-native/usr/include -O2 -pipe -Wno-error=maybe-uninitialized -isystemTOPDIR/tmp/work/x86_64-linux/gn-native/0+git/recipe-sysroot-native/usr/include -O2 -pipe -fvisibility-inlines-hidden -DNDEBUG -O3 -g -fdata-sections -ffunction-sections -D_FILE_OFFSET_BITS=64 -D__STDC_CONSTANT_MACROS -D__STDC_FORMAT_MACROS -pthread -pipe -fno-exceptions -fno-rtti -fdiagnostics-color -Wall -Wextra -Wno-unused-parameter -Wextra-semi -Wundef -std=c++23 -Wno-redundant-move -Wno-restrict -Wno-deprecated-copy -Wno-implicit-fallthrough -Wno-redundant-move -Wno-unused-variable -Wno-format -Wno-strict-aliasing -Wno-cast-function-type -c ../sources/gn-0+git/src/base/files/file_path.cc -o src/base/files/file_path.o
[104/216] g++ -MMD -MF src/gn/exec_process.o.d -I../sources/gn-0+git/src -I../sources/gn-0+git/src/gn/starlark/vendor/cxx/include -I. -isystemTOPDIR/tmp/work/x86_64-linux/gn-native/0+git/recipe-sysroot-native/usr/include -O2 -pipe -Wno-error=maybe-uninitialized -isystemTOPDIR/tmp/work/x86_64-linux/gn-native/0+git/recipe-sysroot-native/usr/include -O2 -pipe -fvisibility-inlines-hidden -DNDEBUG -O3 -g -fdata-sections -ffunction-sections -D_FILE_OFFSET_BITS=64 -D__STDC_CONSTANT_MACROS -D__STDC_FORMAT_MACROS -pthread -pipe -fno-exceptions -fno-rtti -fdiagnostics-color -Wall -Wextra -Wno-unused-parameter -Wextra-semi -Wundef -std=c++23 -Wno-redundant-move -Wno-restrict -Wno-deprecated-copy -Wno-implicit-fallthrough -Wno-redundant-move -Wno-unused-variable -Wno-format -Wno-strict-aliasing -Wno-cast-function-type -c ../sources/gn-0+git/src/gn/exec_process.cc -o src/gn/exec_process.o
[105/216] g++ -MMD -MF src/base/files/file_util_posix.o.d -I../sources/gn-0+git/src -I../sources/gn-0+git/src/gn/starlark/vendor/cxx/include -I. -isystemTOPDIR/tmp/work/x86_64-linux/gn-native/0+git/recipe-sysroot-native/usr/include -O2 -pipe -Wno-error=maybe-uninitialized -isystemTOPDIR/tmp/work/x86_64-linux/gn-native/0+git/recipe-sysroot-native/usr/include -O2 -pipe -fvisibility-inlines-hidden -DNDEBUG -O3 -g -fdata-sections -ffunction-sections -D_FILE_OFFSET_BITS=64 -D__STDC_CONSTANT_MACROS -D__STDC_FORMAT_MACROS -pthread -pipe -fno-exceptions -fno-rtti -fdiagnostics-color -Wall -Wextra -Wno-unused-parameter -Wextra-semi -Wundef -std=c++23 -Wno-redundant-move -Wno-restrict -Wno-deprecated-copy -Wno-implicit-fallthrough -Wno-redundant-move -Wno-unused-variable -Wno-format -Wno-strict-aliasing -Wno-cast-function-type -c ../sources/gn-0+git/src/base/files/file_util_posix.cc -o src/base/files/file_util_posix.o
[106/216] g++ -MMD -MF src/gn/config_values.o.d -I../sources/gn-0+git/src -I../sources/gn-0+git/src/gn/starlark/vendor/cxx/include -I. -isystemTOPDIR/tmp/work/x86_64-linux/gn-native/0+git/recipe-sysroot-native/usr/include -O2 -pipe -Wno-error=maybe-uninitialized -isystemTOPDIR/tmp/work/x86_64-linux/gn-native/0+git/recipe-sysroot-native/usr/include -O2 -pipe -fvisibility-inlines-hidden -DNDEBUG -O3 -g -fdata-sections -ffunction-sections -D_FILE_OFFSET_BITS=64 -D__STDC_CONSTANT_MACROS -D__STDC_FORMAT_MACROS -pthread -pipe -fno-exceptions -fno-rtti -fdiagnostics-color -Wall -Wextra -Wno-unused-parameter -Wextra-semi -Wundef -std=c++23 -Wno-redundant-move -Wno-restrict -Wno-deprecated-copy -Wno-implicit-fallthrough -Wno-redundant-move -Wno-unused-variable -Wno-format -Wno-strict-aliasing -Wno-cast-function-type -c ../sources/gn-0+git/src/gn/config_values.cc -o src/gn/config_values.o
[107/216] g++ -MMD -MF src/base/command_line.o.d -I../sources/gn-0+git/src -I../sources/gn-0+git/src/gn/starlark/vendor/cxx/include -I. -isystemTOPDIR/tmp/work/x86_64-linux/gn-native/0+git/recipe-sysroot-native/usr/include -O2 -pipe -Wno-error=maybe-uninitialized -isystemTOPDIR/tmp/work/x86_64-linux/gn-native/0+git/recipe-sysroot-native/usr/include -O2 -pipe -fvisibility-inlines-hidden -DNDEBUG -O3 -g -fdata-sections -ffunction-sections -D_FILE_OFFSET_BITS=64 -D__STDC_CONSTANT_MACROS -D__STDC_FORMAT_MACROS -pthread -pipe -fno-exceptions -fno-rtti -fdiagnostics-color -Wall -Wextra -Wno-unused-parameter -Wextra-semi -Wundef -std=c++23 -Wno-redundant-move -Wno-restrict -Wno-deprecated-copy -Wno-implicit-fallthrough -Wno-redundant-move -Wno-unused-variable -Wno-format -Wno-strict-aliasing -Wno-cast-function-type -c ../sources/gn-0+git/src/base/command_line.cc -o src/base/command_line.o
[108/216] g++ -MMD -MF src/gn/builder_record.o.d -I../sources/gn-0+git/src -I../sources/gn-0+git/src/gn/starlark/vendor/cxx/include -I. -isystemTOPDIR/tmp/work/x86_64-linux/gn-native/0+git/recipe-sysroot-native/usr/include -O2 -pipe -Wno-error=maybe-uninitialized -isystemTOPDIR/tmp/work/x86_64-linux/gn-native/0+git/recipe-sysroot-native/usr/include -O2 -pipe -fvisibility-inlines-hidden -DNDEBUG -O3 -g -fdata-sections -ffunction-sections -D_FILE_OFFSET_BITS=64 -D__STDC_CONSTANT_MACROS -D__STDC_FORMAT_MACROS -pthread -pipe -fno-exceptions -fno-rtti -fdiagnostics-color -Wall -Wextra -Wno-unused-parameter -Wextra-semi -Wundef -std=c++23 -Wno-redundant-move -Wno-restrict -Wno-deprecated-copy -Wno-implicit-fallthrough -Wno-redundant-move -Wno-unused-variable -Wno-format -Wno-strict-aliasing -Wno-cast-function-type -c ../sources/gn-0+git/src/gn/builder_record.cc -o src/gn/builder_record.o
[109/216] g++ -MMD -MF src/base/strings/string_util.o.d -I../sources/gn-0+git/src -I../sources/gn-0+git/src/gn/starlark/vendor/cxx/include -I. -isystemTOPDIR/tmp/work/x86_64-linux/gn-native/0+git/recipe-sysroot-native/usr/include -O2 -pipe -Wno-error=maybe-uninitialized -isystemTOPDIR/tmp/work/x86_64-linux/gn-native/0+git/recipe-sysroot-native/usr/include -O2 -pipe -fvisibility-inlines-hidden -DNDEBUG -O3 -g -fdata-sections -ffunction-sections -D_FILE_OFFSET_BITS=64 -D__STDC_CONSTANT_MACROS -D__STDC_FORMAT_MACROS -pthread -pipe -fno-exceptions -fno-rtti -fdiagnostics-color -Wall -Wextra -Wno-unused-parameter -Wextra-semi -Wundef -std=c++23 -Wno-redundant-move -Wno-restrict -Wno-deprecated-copy -Wno-implicit-fallthrough -Wno-redundant-move -Wno-unused-variable -Wno-format -Wno-strict-aliasing -Wno-cast-function-type -c ../sources/gn-0+git/src/base/strings/string_util.cc -o src/base/strings/string_util.o
[110/216] g++ -MMD -MF src/base/json/json_parser.o.d -I../sources/gn-0+git/src -I../sources/gn-0+git/src/gn/starlark/vendor/cxx/include -I. -isystemTOPDIR/tmp/work/x86_64-linux/gn-native/0+git/recipe-sysroot-native/usr/include -O2 -pipe -Wno-error=maybe-uninitialized -isystemTOPDIR/tmp/work/x86_64-linux/gn-native/0+git/recipe-sysroot-native/usr/include -O2 -pipe -fvisibility-inlines-hidden -DNDEBUG -O3 -g -fdata-sections -ffunction-sections -D_FILE_OFFSET_BITS=64 -D__STDC_CONSTANT_MACROS -D__STDC_FORMAT_MACROS -pthread -pipe -fno-exceptions -fno-rtti -fdiagnostics-color -Wall -Wextra -Wno-unused-parameter -Wextra-semi -Wundef -std=c++23 -Wno-redundant-move -Wno-restrict -Wno-deprecated-copy -Wno-implicit-fallthrough -Wno-redundant-move -Wno-unused-variable -Wno-format -Wno-strict-aliasing -Wno-cast-function-type -c ../sources/gn-0+git/src/base/json/json_parser.cc -o src/base/json/json_parser.o
[111/216] g++ -MMD -MF src/base/values.o.d -I../sources/gn-0+git/src -I../sources/gn-0+git/src/gn/starlark/vendor/cxx/include -I. -isystemTOPDIR/tmp/work/x86_64-linux/gn-native/0+git/recipe-sysroot-native/usr/include -O2 -pipe -Wno-error=maybe-uninitialized -isystemTOPDIR/tmp/work/x86_64-linux/gn-native/0+git/recipe-sysroot-native/usr/include -O2 -pipe -fvisibility-inlines-hidden -DNDEBUG -O3 -g -fdata-sections -ffunction-sections -D_FILE_OFFSET_BITS=64 -D__STDC_CONSTANT_MACROS -D__STDC_FORMAT_MACROS -pthread -pipe -fno-exceptions -fno-rtti -fdiagnostics-color -Wall -Wextra -Wno-unused-parameter -Wextra-semi -Wundef -std=c++23 -Wno-redundant-move -Wno-restrict -Wno-deprecated-copy -Wno-implicit-fallthrough -Wno-redundant-move -Wno-unused-variable -Wno-format -Wno-strict-aliasing -Wno-cast-function-type -c ../sources/gn-0+git/src/base/values.cc -o src/base/values.o
ninja: build stopped: subcommand failed.
WARNING: exit code 1 from a shell command.