Running '. ./init-build-env; bitbake core-image-minimal:do_testimage core-image-sato:do_testimage core-image-sato-sdk:do_testimage core-image-sato:do_testsdk core-image-minimal:do_testsdkext core-image-sato:do_testsdkext -k' with output to /srv/pokybuild/yocto-worker/qemuriscv64/build/build/command-1-test-targets.log in /srv/pokybuild/yocto-worker/qemuriscv64/build/build
Poky - The Yocto Project testing distribution
NOTE: Reconnecting to bitbake server...
Loading cache...done.
Loaded 1997 entries from dependency cache.
NOTE: Resolving any missing task queue dependencies
Build Configuration:
BB_VERSION = "2.20.0"
BUILD_SYS = "x86_64-linux"
NATIVELSBSTRING = "ubuntu-26.04"
TARGET_SYS = "riscv64-poky-linux"
MACHINE = "qemuriscv64"
SDKMACHINE = "x86_64"
DISTRO = "poky"
DISTRO_VERSION = "6.1.99+snapshot-7c504ae09db5dc015caa5127333b77b150577e1c"
TUNE_FEATURES = "rv 64 i m a f d c zicsr zifencei"
meta = "mathieu/master-next-tests:7c504ae09db5dc015caa5127333b77b150577e1c"
meta-yocto-bsp
meta-poky = "contrib/mathieu/master-next:03d0c19e6eb089e9dd91c5e84ebeb2bfd2aec9e7"
Initialising tasks...Sstate summary: Wanted 150 Local 150 Mirrors 0 Missed 0 Current 301 (100% match, 100% complete)
done.
NOTE: Executing Tasks
NOTE: Setscene tasks completed
NOTE: Running task 1547 of 1552 (/srv/pokybuild/yocto-worker/qemuriscv64/build/layers/openembedded-core/meta/recipes-sato/images/core-image-sato-sdk.bb:do_testimage)
NOTE: Running task 1548 of 1552 (/srv/pokybuild/yocto-worker/qemuriscv64/build/layers/openembedded-core/meta/recipes-sato/images/core-image-sato.bb:do_testimage)
NOTE: Running task 1549 of 1552 (/srv/pokybuild/yocto-worker/qemuriscv64/build/layers/openembedded-core/meta/recipes-sato/images/core-image-sato.bb:do_testsdkext)
NOTE: Running task 1550 of 1552 (/srv/pokybuild/yocto-worker/qemuriscv64/build/layers/openembedded-core/meta/recipes-sato/images/core-image-sato.bb:do_testsdk)
NOTE: Running task 1551 of 1552 (/srv/pokybuild/yocto-worker/qemuriscv64/build/layers/openembedded-core/meta/recipes-core/images/core-image-minimal.bb:do_testimage)
NOTE: Running task 1552 of 1552 (/srv/pokybuild/yocto-worker/qemuriscv64/build/layers/openembedded-core/meta/recipes-core/images/core-image-minimal.bb:do_testsdkext)
NOTE: recipe core-image-sato-sdk-1.0-r0: task do_testimage: Started
NOTE: recipe core-image-sato-1.0-r0: task do_testimage: Started
NOTE: recipe core-image-sato-1.0-r0: task do_testsdk: Started
NOTE: recipe core-image-sato-1.0-r0: task do_testsdkext: Started
NOTE: recipe core-image-minimal-1.0-r0: task do_testimage: Started
NOTE: recipe core-image-minimal-1.0-r0: task do_testsdkext: Started
QMP Available for connection at /srv/pokybuild/yocto-worker/qemuriscv64/build/build/tmp/.fzvxifyz
QMP Available for connection at /srv/pokybuild/yocto-worker/qemuriscv64/build/build/tmp/.04cm5uaq
QMP Available for connection at /srv/pokybuild/yocto-worker/qemuriscv64/build/build/tmp/.lbz93g8s
QMP connected to QEMU at 10/29/26 09:51:11 and took 1.57 seconds
QMP released QEMU at 10/29/26 09:51:12 and took 0.29 seconds from connect
QMP connected to QEMU at 10/29/26 09:51:17 and took 8.32 seconds
QMP released QEMU at 10/29/26 09:51:18 and took 0.15 seconds from connect
QMP connected to QEMU at 10/29/26 09:51:40 and took 30.49 seconds
QMP released QEMU at 10/29/26 09:51:40 and took 0.27 seconds from connect
Test requires apt to be installed
Test requires openssh-sshd, or dropbear to be installed
Test requires autoconf to be installed
Test requires gtk+3 to be installed
Test requires autoconf to be installed
Test requires connman to be installed
Test case connman.ConnmanTest.test_connmand_running depends on connman.ConnmanTest.test_connmand_help but it didn't pass/run.
Test case date.DateTest.test_date depends on ssh.SSHTest.test_ssh but it didn't pass/run.
Test case df.DfTest.test_df depends on ssh.SSHTest.test_ssh but it didn't pass/run.
Test case dnf.DnfBasicTest.test_dnf_help depends on ssh.SSHTest.test_ssh but it didn't pass/run.
Test case dnf.DnfBasicTest.test_dnf_history depends on dnf.DnfBasicTest.test_dnf_help but it didn't pass/run.
Test case dnf.DnfBasicTest.test_dnf_info depends on dnf.DnfBasicTest.test_dnf_help but it didn't pass/run.
Test case dnf.DnfBasicTest.test_dnf_search depends on dnf.DnfBasicTest.test_dnf_help but it didn't pass/run.
Test case dnf.DnfBasicTest.test_dnf_version depends on dnf.DnfBasicTest.test_dnf_help but it didn't pass/run.
Test case dnf.DnfRepoTest.test_dnf_makecache depends on dnf.DnfBasicTest.test_dnf_help but it didn't pass/run.
Test case dnf.DnfRepoTest.test_dnf_exclude depends on dnf.DnfRepoTest.test_dnf_makecache but it didn't pass/run.
Test case dnf.DnfRepoTest.test_dnf_install depends on dnf.DnfRepoTest.test_dnf_makecache but it didn't pass/run.
Test case dnf.DnfRepoTest.test_dnf_install_dependency depends on dnf.DnfRepoTest.test_dnf_install but it didn't pass/run.
Test case dnf.DnfRepoTest.test_dnf_install_from_disk depends on dnf.DnfRepoTest.test_dnf_install_dependency but it didn't pass/run.
Test case dnf.DnfRepoTest.test_dnf_install_from_http depends on dnf.DnfRepoTest.test_dnf_install_from_disk but it didn't pass/run.
Test case dnf.DnfRepoTest.test_dnf_installroot depends on dnf.DnfRepoTest.test_dnf_makecache but it didn't pass/run.
Test run when enable usrmerge
Test case dnf.DnfRepoTest.test_dnf_reinstall depends on dnf.DnfRepoTest.test_dnf_install but it didn't pass/run.
Test case dnf.DnfRepoTest.test_dnf_repoinfo depends on dnf.DnfRepoTest.test_dnf_makecache but it didn't pass/run.
Test requires gcc to be installed
Test requires g++ to be installed
Test requires g++ to be installed
Test requires make to be installed
Test requires python3-pygobject to be installed
Test requires cgo-helloworld to be installed
Test requires go-runtime-dev to be installed
Test requires go-runtime-dev to be installed
Test requires go-helloworld to be installed
Test requires gcc to be installed
Test case ldd.LddTest.test_ldd depends on ssh.SSHTest.test_ssh but it didn't pass/run.
Test requires logrotate to be installed
Test case logrotate.LogrotateTest.test_logrotate_newlog depends on logrotate.LogrotateTest.test_logrotate_wtmp but it didn't pass/run.
Test case oe_syslog.SyslogTest.test_syslog_running depends on ssh.SSHTest.test_ssh but it didn't pass/run.
Test case oe_syslog.SyslogTestConfig.test_syslog_logger depends on oe_syslog.SyslogTest.test_syslog_running but it didn't pass/run.
Test case oe_syslog.SyslogTestConfig.test_syslog_restart depends on oe_syslog.SyslogTest.test_syslog_running but it didn't pass/run.
Test case oe_syslog.SyslogTestConfig.test_syslog_startup_config depends on oe_syslog.SyslogTestConfig.test_syslog_logger but it didn't pass/run.
Test requires opkg to be installed
Test requires shadow-base to be installed
Test case parselogs.ParseLogsTest.test_parselogs depends on ssh.SSHTest.test_ssh but it didn't pass/run.
Test requires perl to be installed
Test requires ptest-runner to be installed
Test requires ptest-runner to be installed
Test requires python3-core to be installed
Test case rpm.RpmBasicTest.test_rpm_help depends on ssh.SSHTest.test_ssh but it didn't pass/run.
Test case rpm.RpmBasicTest.test_rpm_query depends on rpm.RpmBasicTest.test_rpm_help but it didn't pass/run.
Test case rpm.RpmBasicTest.test_rpm_query_nonroot depends on rpm.RpmBasicTest.test_rpm_query but it didn't pass/run.
Test case rpm.RpmInstallRemoveTest.test_rpm_install depends on rpm.RpmBasicTest.test_rpm_query but it didn't pass/run.
Test case rpm.RpmInstallRemoveTest.test_rpm_remove depends on rpm.RpmInstallRemoveTest.test_rpm_install but it didn't pass/run.
Test case rpm.RpmInstallRemoveTest.test_check_rpm_install_removal_log_file_size depends on rpm.RpmInstallRemoveTest.test_rpm_remove but it didn't pass/run.
Test requires rust-c-lib-example-bin to be installed
Test requires openssh-scp to be installed
Test requires openssh-scp to be installed
Test requires openssh-scp, or openssh-sftp-server to be installed
Test requires kernel-devsrc to be installed
Test case systemd.SystemdBasicTests.test_systemd_basic depends on ssh.SSHTest.test_ssh but it didn't pass/run.
Test case systemd.SystemdBasicTests.test_systemd_failed depends on systemd.SystemdBasicTests.test_systemd_basic but it didn't pass/run.
Test case systemd.SystemdBasicTests.test_systemd_list depends on systemd.SystemdBasicTests.test_systemd_basic but it didn't pass/run.
Test case systemd.SystemdJournalTests.test_systemd_boot_time depends on systemd.SystemdBasicTests.test_systemd_basic but it didn't pass/run.
Test case systemd.SystemdJournalTests.test_systemd_journal depends on systemd.SystemdBasicTests.test_systemd_basic but it didn't pass/run.
Test requires minidebuginfo to be in DISTRO_FEATURES
Test case systemd.SystemdServiceTests.test_systemd_status depends on systemd.SystemdBasicTests.test_systemd_basic but it didn't pass/run.
Test case systemd.SystemdServiceTests.test_systemd_disable_enable depends on systemd.SystemdServiceTests.test_systemd_status but it didn't pass/run.
Test is only meant to run with read-only-rootfs in IMAGE_FEATURES
Test case systemd.SystemdServiceTests.test_systemd_stop_start depends on systemd.SystemdServiceTests.test_systemd_status but it didn't pass/run.
Test requires wayland-utils to be installed
Test requires weston to be installed
Test requires weston to be installed
Test requires weston to be installed
Test requires xserver-nodm-init to be installed
Output from runqemu:
runqemu - INFO - Received signal: 15
runqemu - INFO - Cleaning up
runqemu - INFO - Host uptime: 829081.35
runqemu - INFO - Removing /srv/pokybuild/yocto-worker/qemuriscv64/build/build/tmp/deploy/images/qemuriscv64/core-image-minimal-qemuriscv64.rootfs-20261029082726.ext4
runqemu - INFO - Removing /home/pokybuild/tmp/core-image-minimal-qemuriscv64.rootfs-20261029082726.ext4.3336020
tput: No value for $TERM and no -T specified
RESULTS:
RESULTS - parselogs.ParseLogsTest.test_get_context: PASSED (0.00s)
RESULTS - ping.PingTest.test_ping: PASSED (0.14s)
RESULTS - apt.AptRepoTest.test_apt_install_from_repo: SKIPPED (0.00s)
RESULTS - buildcpio.BuildCpioTest.test_cpio: SKIPPED (0.00s)
RESULTS - buildgalculator.GalculatorTest.test_galculator: SKIPPED (0.00s)
RESULTS - buildlzip.BuildLzipTest.test_lzip: SKIPPED (0.00s)
RESULTS - connman.ConnmanTest.test_connmand_help: SKIPPED (0.00s)
RESULTS - connman.ConnmanTest.test_connmand_running: SKIPPED (0.00s)
RESULTS - date.DateTest.test_date: SKIPPED (0.00s)
RESULTS - df.DfTest.test_df: SKIPPED (0.00s)
RESULTS - dnf.DnfBasicTest.test_dnf_help: SKIPPED (0.00s)
RESULTS - dnf.DnfBasicTest.test_dnf_history: SKIPPED (0.00s)
RESULTS - dnf.DnfBasicTest.test_dnf_info: SKIPPED (0.00s)
RESULTS - dnf.DnfBasicTest.test_dnf_search: SKIPPED (0.00s)
RESULTS - dnf.DnfBasicTest.test_dnf_version: SKIPPED (0.00s)
RESULTS - dnf.DnfRepoTest.test_dnf_exclude: SKIPPED (0.00s)
RESULTS - dnf.DnfRepoTest.test_dnf_install: SKIPPED (0.00s)
RESULTS - dnf.DnfRepoTest.test_dnf_install_dependency: SKIPPED (0.00s)
RESULTS - dnf.DnfRepoTest.test_dnf_install_from_disk: SKIPPED (0.00s)
RESULTS - dnf.DnfRepoTest.test_dnf_install_from_http: SKIPPED (0.00s)
RESULTS - dnf.DnfRepoTest.test_dnf_installroot: SKIPPED (0.00s)
RESULTS - dnf.DnfRepoTest.test_dnf_installroot_usrmerge: SKIPPED (0.00s)
RESULTS - dnf.DnfRepoTest.test_dnf_makecache: SKIPPED (0.00s)
RESULTS - dnf.DnfRepoTest.test_dnf_reinstall: SKIPPED (0.00s)
RESULTS - dnf.DnfRepoTest.test_dnf_repoinfo: SKIPPED (0.00s)
RESULTS - gcc.GccCompileTest.test_gcc_compile: SKIPPED (0.00s)
RESULTS - gcc.GccCompileTest.test_gpp2_compile: SKIPPED (0.00s)
RESULTS - gcc.GccCompileTest.test_gpp_compile: SKIPPED (0.00s)
RESULTS - gcc.GccCompileTest.test_make: SKIPPED (0.00s)
RESULTS - gi.GObjectIntrospectionTest.test_python: SKIPPED (0.00s)
RESULTS - go.CgoHelloworldTest.test_cgohelloworld: SKIPPED (0.00s)
RESULTS - go.GoCompileTest.test_go_compile: SKIPPED (0.00s)
RESULTS - go.GoCompileTest.test_go_module: SKIPPED (0.00s)
RESULTS - go.GoHelloworldTest.test_gohelloworld: SKIPPED (0.00s)
RESULTS - kernelmodule.KernelModuleTest.test_kernel_module: SKIPPED (0.00s)
RESULTS - ldd.LddTest.test_ldd: SKIPPED (0.00s)
RESULTS - logrotate.LogrotateTest.test_logrotate_newlog: SKIPPED (0.00s)
RESULTS - logrotate.LogrotateTest.test_logrotate_wtmp: SKIPPED (0.00s)
RESULTS - oe_syslog.SyslogTest.test_syslog_running: SKIPPED (0.00s)
RESULTS - oe_syslog.SyslogTestConfig.test_syslog_logger: SKIPPED (0.00s)
RESULTS - oe_syslog.SyslogTestConfig.test_syslog_restart: SKIPPED (0.00s)
RESULTS - oe_syslog.SyslogTestConfig.test_syslog_startup_config: SKIPPED (0.00s)
RESULTS - opkg.OpkgRepoTest.test_opkg_install_from_repo: SKIPPED (0.00s)
RESULTS - pam.PamBasicTest.test_pam: SKIPPED (0.00s)
RESULTS - parselogs.ParseLogsTest.test_parselogs: SKIPPED (0.00s)
RESULTS - perl.PerlTest.test_perl_works: SKIPPED (0.00s)
RESULTS - ptest.PtestRunnerTest.test_ptestrunner_expectfail: SKIPPED (0.00s)
RESULTS - ptest.PtestRunnerTest.test_ptestrunner_expectsuccess: SKIPPED (0.00s)
RESULTS - python.PythonTest.test_python3: SKIPPED (0.00s)
RESULTS - rpm.RpmBasicTest.test_rpm_help: SKIPPED (0.00s)
RESULTS - rpm.RpmBasicTest.test_rpm_query: SKIPPED (0.00s)
RESULTS - rpm.RpmBasicTest.test_rpm_query_nonroot: SKIPPED (0.00s)
RESULTS - rpm.RpmInstallRemoveTest.test_check_rpm_install_removal_log_file_size: SKIPPED (0.00s)
RESULTS - rpm.RpmInstallRemoveTest.test_rpm_install: SKIPPED (0.00s)
RESULTS - rpm.RpmInstallRemoveTest.test_rpm_remove: SKIPPED (0.00s)
RESULTS - rust.RustCLibExampleTest.test_rust_c_lib_example: SKIPPED (0.00s)
RESULTS - rust.RustCompileTest.test_cargo_compile: SKIPPED (0.00s)
RESULTS - rust.RustCompileTest.test_rust_compile: SKIPPED (0.00s)
RESULTS - scp.ScpTest.test_scp_file: SKIPPED (0.00s)
RESULTS - ssh.SSHTest.test_ssh: SKIPPED (0.00s)
RESULTS - stap.StapTest.test_stap: SKIPPED (0.00s)
RESULTS - systemd.SystemdBasicTests.test_systemd_basic: SKIPPED (0.00s)
RESULTS - systemd.SystemdBasicTests.test_systemd_failed: SKIPPED (0.00s)
RESULTS - systemd.SystemdBasicTests.test_systemd_list: SKIPPED (0.00s)
RESULTS - systemd.SystemdJournalTests.test_systemd_boot_time: SKIPPED (0.00s)
RESULTS - systemd.SystemdJournalTests.test_systemd_journal: SKIPPED (0.00s)
RESULTS - systemd.SystemdServiceTests.test_systemd_coredump_minidebuginfo: SKIPPED (0.00s)
RESULTS - systemd.SystemdServiceTests.test_systemd_disable_enable: SKIPPED (0.00s)
RESULTS - systemd.SystemdServiceTests.test_systemd_disable_enable_ro: SKIPPED (0.00s)
RESULTS - systemd.SystemdServiceTests.test_systemd_status: SKIPPED (0.00s)
RESULTS - systemd.SystemdServiceTests.test_systemd_stop_start: SKIPPED (0.00s)
RESULTS - weston.WestonTest.test_wayland_info: SKIPPED (0.00s)
RESULTS - weston.WestonTest.test_weston_can_initialize_new_wayland_compositor: SKIPPED (0.00s)
RESULTS - weston.WestonTest.test_weston_running: SKIPPED (0.00s)
RESULTS - weston.WestonTest.test_weston_supports_xwayland: SKIPPED (0.00s)
RESULTS - xorg.XorgTest.test_xorg_running: SKIPPED (0.00s)
SUMMARY:
core-image-minimal () - Ran 76 tests in 0.399s
core-image-minimal - OK - All required tests passed (successes=2, skipped=74, failures=0, errors=0)
NOTE: recipe core-image-minimal-1.0-r0: task do_testimage: Succeeded
Test requires apt to be installed
Test requires autoconf to be installed
Test requires gtk+3 to be installed
Test requires autoconf to be installed
Test requires apt to be installed
SDK testing environment: riscv64imafdc_zicsr_zifencei-poky-linux
Extensible SDK testing environment: riscv64imafdc_zicsr_zifencei-poky-linux
Extensible SDK testing environment: riscv64imafdc_zicsr_zifencei-poky-linux
GoCompileTest class: go command not available: Command '. /srv/pokybuild/yocto-worker/qemuriscv64/build/build/tmp/work/qemuriscv64-poky-linux/core-image-sato/1.0/testimage-sdk/environment-setup-riscv64imafdc_zicsr_zifencei-poky-linux > /dev/null; which go;' returned non-zero exit status 1.
Standard Output:
GoCompileTest class: go command not available: Command '. /srv/pokybuild/yocto-worker/qemuriscv64/build/build/tmp/work/qemuriscv64-poky-linux/core-image-sato/1.0/testimage-sdk/environment-setup-riscv64imafdc_zicsr_zifencei-poky-linux > /dev/null; which go;' returned non-zero exit status 1.
Standard Output:
GoHostCompileTest class: go command not available: Command '. /srv/pokybuild/yocto-worker/qemuriscv64/build/build/tmp/work/qemuriscv64-poky-linux/core-image-sato/1.0/testimage-sdk/environment-setup-riscv64imafdc_zicsr_zifencei-poky-linux > /dev/null; which go;' returned non-zero exit status 1.
Standard Output:
GoHostCompileTest class: go command not available: Command '. /srv/pokybuild/yocto-worker/qemuriscv64/build/build/tmp/work/qemuriscv64-poky-linux/core-image-sato/1.0/testimage-sdk/environment-setup-riscv64imafdc_zicsr_zifencei-poky-linux > /dev/null; which go;' returned non-zero exit status 1.
Standard Output:
Test kmod.KernelModuleTest.test_cryptodev needs one of kernel-devsrc
Test maturin.MaturinDevelopTest.test_maturin_develop needs one of python3-maturin
Test maturin.MaturinTest.test_maturin_list_python needs one of python3-maturin
GoCompileTest class: SDK doesn't contain a Go cross-canadian toolchain
GoCompileTest class: SDK doesn't contain a Go cross-canadian toolchain
GoHostCompileTest class: SDK doesn't contain a Go cross-canadian toolchain
GoHostCompileTest class: SDK doesn't contain a Go cross-canadian toolchain
gtk3.GTK3Test.test_libhandy does not support eSDK (https://bugzilla.yoctoproject.org/show_bug.cgi?id=15854)
kmod.KernelModuleTest.test_cryptodev does not support eSDK (https://bugzilla.yoctoproject.org/show_bug.cgi?id=15850)
RESULTS:
RESULTS - autotools.AutotoolsTest.test_cpio: PASSED (248.74s)
RESULTS - cmake.CMakeTest.test_assimp: PASSED (911.32s)
RESULTS - gcc.GccCompileTest.test_gcc_compile: PASSED (1.35s)
RESULTS - gcc.GccCompileTest.test_gpp2_compile: PASSED (1.91s)
RESULTS - gcc.GccCompileTest.test_gpp_compile: PASSED (9.04s)
RESULTS - gcc.GccCompileTest.test_make: PASSED (0.75s)
RESULTS - gtk3.GTK3Test.test_libhandy: PASSED (51.71s)
RESULTS - makefile.MakefileTest.test_lzip: PASSED (17.70s)
RESULTS - manifest.ManifestTest.test_manifests: PASSED (0.00s)
RESULTS - meson.MesonTest.test_iputils: PASSED (39.80s)
RESULTS - perl.PerlTest.test_perl: PASSED (0.11s)
RESULTS - python.Python3Test.test_python3: PASSED (0.22s)
RESULTS - rust.RustCompileTest.test_cargo_build: PASSED (147.72s)
RESULTS - rust.RustHostCompileTest.test_cargo_build: PASSED (118.30s)
RESULTS - go.GoCompileTest.test_go_build: SKIPPED (0.04s)
RESULTS - go.GoCompileTest.test_go_module: SKIPPED (0.04s)
RESULTS - go.GoHostCompileTest.test_go_cross_compile: SKIPPED (0.04s)
RESULTS - go.GoHostCompileTest.test_go_module_cross_compile: SKIPPED (0.04s)
RESULTS - kmod.KernelModuleTest.test_cryptodev: SKIPPED (0.00s)
RESULTS - maturin.MaturinDevelopTest.test_maturin_develop: SKIPPED (0.00s)
RESULTS - maturin.MaturinTest.test_maturin_list_python: SKIPPED (0.00s)
SUMMARY:
core-image-sato sdk (poky-glibc-x86_64-core-image-sato-riscv64imafdc_zicsr_zifencei-qemuriscv64-toolchain-6.1.99+snapshot.sh:environment-setup-riscv64imafdc_zicsr_zifencei-poky-linux) - Ran 21 tests in 1549.874s
core-image-sato sdk - OK - All required tests passed (successes=14, skipped=7, failures=0, errors=0)
NOTE: recipe core-image-sato-1.0-r0: task do_testsdk: Succeeded
Test run when enable usrmerge
GoCompileTest class: SDK doesn't contain a Go cross-canadian toolchain
GoCompileTest class: SDK doesn't contain a Go cross-canadian toolchain
GoHostCompileTest class: SDK doesn't contain a Go cross-canadian toolchain
GoHostCompileTest class: SDK doesn't contain a Go cross-canadian toolchain
gtk3.GTK3Test.test_libhandy does not support eSDK (https://bugzilla.yoctoproject.org/show_bug.cgi?id=15854)
kmod.KernelModuleTest.test_cryptodev does not support eSDK (https://bugzilla.yoctoproject.org/show_bug.cgi?id=15850)
Testing 'maturin develop' requires Rust cross-canadian in the SDK
meson.MesonTest.test_iputils does not support eSDK (https://bugzilla.yoctoproject.org/show_bug.cgi?id=15854)
Test requires gcc to be installed
Test requires g++ to be installed
Test requires g++ to be installed
Test requires make to be installed
Test requires python3-pygobject to be installed
Test requires cgo-helloworld to be installed
Test requires go-runtime-dev to be installed
Test requires go-runtime-dev to be installed
Test requires go-helloworld to be installed
Test requires gcc to be installed
Test requires ldd to be installed
Test requires logrotate to be installed
Test case logrotate.LogrotateTest.test_logrotate_newlog depends on logrotate.LogrotateTest.test_logrotate_wtmp but it didn't pass/run.
RustCompileTest class: SDK doesn't contain a Rust cross-canadian toolchain
RustCompileTest class: SDK doesn't contain a Rust cross-canadian toolchain
Test requires opkg to be installed
Test requires pam to be in DISTRO_FEATURES
Testing 'maturin develop' requires Rust cross-canadian in the SDK
Test requires ptest-runner to be installed
Test requires ptest-runner to be installed
meson.MesonTest.test_iputils does not support eSDK (https://bugzilla.yoctoproject.org/show_bug.cgi?id=15854)
RustCompileTest class: SDK doesn't contain a Rust cross-canadian toolchain
RustCompileTest class: SDK doesn't contain a Rust cross-canadian toolchain
Test requires rust-c-lib-example-bin to be installed
Test requires openssh-scp to be installed
Test requires openssh-scp to be installed
Test requires kernel-devsrc to be installed
systemd is not the init manager for this image
Test case systemd.SystemdBasicTests.test_systemd_failed depends on systemd.SystemdBasicTests.test_systemd_basic but it didn't pass/run.
Test case systemd.SystemdBasicTests.test_systemd_list depends on systemd.SystemdBasicTests.test_systemd_basic but it didn't pass/run.
Test case systemd.SystemdJournalTests.test_systemd_boot_time depends on systemd.SystemdBasicTests.test_systemd_basic but it didn't pass/run.
Test case systemd.SystemdJournalTests.test_systemd_journal depends on systemd.SystemdBasicTests.test_systemd_basic but it didn't pass/run.
Test requires minidebuginfo to be in DISTRO_FEATURES
Test case systemd.SystemdServiceTests.test_systemd_status depends on systemd.SystemdBasicTests.test_systemd_basic but it didn't pass/run.
Test case systemd.SystemdServiceTests.test_systemd_disable_enable depends on systemd.SystemdServiceTests.test_systemd_status but it didn't pass/run.
Test is only meant to run with read-only-rootfs in IMAGE_FEATURES
Test case systemd.SystemdServiceTests.test_systemd_stop_start depends on systemd.SystemdServiceTests.test_systemd_status but it didn't pass/run.
Test requires wayland-utils to be installed
Test requires weston to be installed
Test requires weston to be installed
Test requires weston to be installed
Output from runqemu:
runqemu - INFO - Received signal: 15
runqemu - INFO - Cleaning up
runqemu - INFO - Host uptime: 831204.99
runqemu - INFO - Removing /srv/pokybuild/yocto-worker/qemuriscv64/build/build/tmp/deploy/images/qemuriscv64/core-image-sato-qemuriscv64.rootfs-20261029082726.ext4
runqemu - INFO - Removing /home/pokybuild/tmp/core-image-sato-qemuriscv64.rootfs-20261029082726.ext4.3336010
tput: No value for $TERM and no -T specified
RESULTS:
RESULTS - connman.ConnmanTest.test_connmand_help: PASSED (1.43s)
RESULTS - connman.ConnmanTest.test_connmand_running: PASSED (1.43s)
RESULTS - date.DateTest.test_date: PASSED (4.62s)
RESULTS - df.DfTest.test_df: PASSED (1.20s)
RESULTS - dnf.DnfBasicTest.test_dnf_help: PASSED (114.20s)
RESULTS - dnf.DnfBasicTest.test_dnf_history: PASSED (57.68s)
RESULTS - dnf.DnfBasicTest.test_dnf_info: PASSED (48.32s)
RESULTS - dnf.DnfBasicTest.test_dnf_search: PASSED (32.84s)
RESULTS - dnf.DnfBasicTest.test_dnf_version: PASSED (71.68s)
RESULTS - dnf.DnfRepoTest.test_dnf_exclude: PASSED (191.97s)
RESULTS - dnf.DnfRepoTest.test_dnf_install: PASSED (173.53s)
RESULTS - dnf.DnfRepoTest.test_dnf_install_dependency: PASSED (191.46s)
RESULTS - dnf.DnfRepoTest.test_dnf_install_from_disk: PASSED (241.64s)
RESULTS - dnf.DnfRepoTest.test_dnf_install_from_http: PASSED (88.85s)
RESULTS - dnf.DnfRepoTest.test_dnf_installroot: PASSED (500.14s)
RESULTS - dnf.DnfRepoTest.test_dnf_makecache: PASSED (34.61s)
RESULTS - dnf.DnfRepoTest.test_dnf_reinstall: PASSED (71.72s)
RESULTS - dnf.DnfRepoTest.test_dnf_repoinfo: PASSED (39.86s)
RESULTS - oe_syslog.SyslogTest.test_syslog_running: PASSED (1.35s)
RESULTS - oe_syslog.SyslogTestConfig.test_syslog_logger: PASSED (3.26s)
RESULTS - oe_syslog.SyslogTestConfig.test_syslog_restart: PASSED (13.18s)
RESULTS - oe_syslog.SyslogTestConfig.test_syslog_startup_config: PASSED (29.35s)
RESULTS - parselogs.ParseLogsTest.test_get_context: PASSED (0.00s)
RESULTS - parselogs.ParseLogsTest.test_parselogs: PASSED (13.14s)
RESULTS - perl.PerlTest.test_perl_works: PASSED (1.85s)
RESULTS - ping.PingTest.test_ping: PASSED (0.12s)
RESULTS - python.PythonTest.test_python3: PASSED (3.67s)
RESULTS - rpm.RpmBasicTest.test_rpm_help: PASSED (1.60s)
RESULTS - rpm.RpmBasicTest.test_rpm_query: PASSED (3.08s)
RESULTS - rpm.RpmBasicTest.test_rpm_query_nonroot: PASSED (47.50s)
RESULTS - rpm.RpmInstallRemoveTest.test_check_rpm_install_removal_log_file_size: PASSED (100.93s)
RESULTS - rpm.RpmInstallRemoveTest.test_rpm_install: PASSED (7.57s)
RESULTS - rpm.RpmInstallRemoveTest.test_rpm_remove: PASSED (4.60s)
RESULTS - scp.ScpTest.test_scp_file: PASSED (4.67s)
RESULTS - ssh.SSHTest.test_ssh: PASSED (1.69s)
RESULTS - xorg.XorgTest.test_xorg_running: PASSED (2.65s)
RESULTS - apt.AptRepoTest.test_apt_install_from_repo: SKIPPED (0.00s)
RESULTS - buildcpio.BuildCpioTest.test_cpio: SKIPPED (0.00s)
RESULTS - buildgalculator.GalculatorTest.test_galculator: SKIPPED (0.00s)
RESULTS - buildlzip.BuildLzipTest.test_lzip: SKIPPED (0.00s)
RESULTS - dnf.DnfRepoTest.test_dnf_installroot_usrmerge: SKIPPED (0.00s)
RESULTS - gcc.GccCompileTest.test_gcc_compile: SKIPPED (0.00s)
RESULTS - gcc.GccCompileTest.test_gpp2_compile: SKIPPED (0.00s)
RESULTS - gcc.GccCompileTest.test_gpp_compile: SKIPPED (0.00s)
RESULTS - gcc.GccCompileTest.test_make: SKIPPED (0.00s)
RESULTS - gi.GObjectIntrospectionTest.test_python: SKIPPED (0.00s)
RESULTS - go.CgoHelloworldTest.test_cgohelloworld: SKIPPED (0.00s)
RESULTS - go.GoCompileTest.test_go_compile: SKIPPED (0.00s)
RESULTS - go.GoCompileTest.test_go_module: SKIPPED (0.00s)
RESULTS - go.GoHelloworldTest.test_gohelloworld: SKIPPED (0.00s)
RESULTS - kernelmodule.KernelModuleTest.test_kernel_module: SKIPPED (0.00s)
RESULTS - ldd.LddTest.test_ldd: SKIPPED (0.00s)
RESULTS - logrotate.LogrotateTest.test_logrotate_newlog: SKIPPED (0.00s)
RESULTS - logrotate.LogrotateTest.test_logrotate_wtmp: SKIPPED (0.00s)
RESULTS - opkg.OpkgRepoTest.test_opkg_install_from_repo: SKIPPED (0.00s)
RESULTS - pam.PamBasicTest.test_pam: SKIPPED (0.00s)
RESULTS - ptest.PtestRunnerTest.test_ptestrunner_expectfail: SKIPPED (0.00s)
RESULTS - ptest.PtestRunnerTest.test_ptestrunner_expectsuccess: SKIPPED (0.00s)
RESULTS - rust.RustCLibExampleTest.test_rust_c_lib_example: SKIPPED (0.00s)
RESULTS - rust.RustCompileTest.test_cargo_compile: SKIPPED (0.00s)
RESULTS - rust.RustCompileTest.test_rust_compile: SKIPPED (0.00s)
RESULTS - stap.StapTest.test_stap: SKIPPED (0.00s)
RESULTS - systemd.SystemdBasicTests.test_systemd_basic: SKIPPED (0.00s)
RESULTS - systemd.SystemdBasicTests.test_systemd_failed: SKIPPED (0.00s)
RESULTS - systemd.SystemdBasicTests.test_systemd_list: SKIPPED (0.00s)
RESULTS - systemd.SystemdJournalTests.test_systemd_boot_time: SKIPPED (0.00s)
RESULTS - systemd.SystemdJournalTests.test_systemd_journal: SKIPPED (0.00s)
RESULTS - systemd.SystemdServiceTests.test_systemd_coredump_minidebuginfo: SKIPPED (0.00s)
RESULTS - systemd.SystemdServiceTests.test_systemd_disable_enable: SKIPPED (0.00s)
RESULTS - systemd.SystemdServiceTests.test_systemd_disable_enable_ro: SKIPPED (0.00s)
RESULTS - systemd.SystemdServiceTests.test_systemd_status: SKIPPED (0.00s)
RESULTS - systemd.SystemdServiceTests.test_systemd_stop_start: SKIPPED (0.00s)
RESULTS - weston.WestonTest.test_wayland_info: SKIPPED (0.00s)
RESULTS - weston.WestonTest.test_weston_can_initialize_new_wayland_compositor: SKIPPED (0.00s)
RESULTS - weston.WestonTest.test_weston_running: SKIPPED (0.00s)
RESULTS - weston.WestonTest.test_weston_supports_xwayland: SKIPPED (0.00s)
SUMMARY:
core-image-sato () - Ran 76 tests in 2107.603s
core-image-sato - OK - All required tests passed (successes=36, skipped=40, failures=0, errors=0)
NOTE: recipe core-image-sato-1.0-r0: task do_testimage: Succeeded
Bitbake still alive (no events for 600s). Active tasks:
/srv/pokybuild/yocto-worker/qemuriscv64/build/layers/openembedded-core/meta/recipes-sato/images/core-image-sato-sdk.bb:do_testimage
/srv/pokybuild/yocto-worker/qemuriscv64/build/layers/openembedded-core/meta/recipes-sato/images/core-image-sato.bb:do_testsdkext
/srv/pokybuild/yocto-worker/qemuriscv64/build/layers/openembedded-core/meta/recipes-core/images/core-image-minimal.bb:do_testsdkext
Bitbake still alive (no events for 1200s). Active tasks:
/srv/pokybuild/yocto-worker/qemuriscv64/build/layers/openembedded-core/meta/recipes-sato/images/core-image-sato-sdk.bb:do_testimage
/srv/pokybuild/yocto-worker/qemuriscv64/build/layers/openembedded-core/meta/recipes-sato/images/core-image-sato.bb:do_testsdkext
/srv/pokybuild/yocto-worker/qemuriscv64/build/layers/openembedded-core/meta/recipes-core/images/core-image-minimal.bb:do_testsdkext
Bitbake still alive (no events for 1800s). Active tasks:
/srv/pokybuild/yocto-worker/qemuriscv64/build/layers/openembedded-core/meta/recipes-sato/images/core-image-sato-sdk.bb:do_testimage
/srv/pokybuild/yocto-worker/qemuriscv64/build/layers/openembedded-core/meta/recipes-sato/images/core-image-sato.bb:do_testsdkext
/srv/pokybuild/yocto-worker/qemuriscv64/build/layers/openembedded-core/meta/recipes-core/images/core-image-minimal.bb:do_testsdkext
Bitbake still alive (no events for 2400s). Active tasks:
/srv/pokybuild/yocto-worker/qemuriscv64/build/layers/openembedded-core/meta/recipes-sato/images/core-image-sato-sdk.bb:do_testimage
/srv/pokybuild/yocto-worker/qemuriscv64/build/layers/openembedded-core/meta/recipes-sato/images/core-image-sato.bb:do_testsdkext
/srv/pokybuild/yocto-worker/qemuriscv64/build/layers/openembedded-core/meta/recipes-core/images/core-image-minimal.bb:do_testsdkext
Test requires gtk+3 to be installed
RESULTS:
RESULTS - autotools.AutotoolsTest.test_cpio: PASSED (265.14s)
RESULTS - cmake.CMakeTest.test_assimp: PASSED (858.71s)
RESULTS - gcc.GccCompileTest.test_gcc_compile: PASSED (0.79s)
RESULTS - gcc.GccCompileTest.test_gpp2_compile: PASSED (0.78s)
RESULTS - gcc.GccCompileTest.test_gpp_compile: PASSED (2.32s)
RESULTS - gcc.GccCompileTest.test_make: PASSED (0.82s)
RESULTS - makefile.MakefileTest.test_lzip: PASSED (14.99s)
RESULTS - manifest.ManifestTest.test_manifests: PASSED (0.00s)
RESULTS - maturin.MaturinTest.test_maturin_list_python: PASSED (14.52s)
RESULTS - perl.PerlTest.test_perl: PASSED (0.12s)
RESULTS - python.Python3Test.test_python3: PASSED (10.50s)
RESULTS - devtool.DevtoolTest.test_devtool_add_reset: PASSED (51.21s)
RESULTS - devtool.DevtoolTest.test_devtool_build_cmake: PASSED (143.32s)
RESULTS - devtool.DevtoolTest.test_devtool_build_esdk_package: PASSED (117.42s)
RESULTS - devtool.DevtoolTest.test_devtool_build_make: PASSED (124.19s)
RESULTS - devtool.DevtoolTest.test_devtool_kernelmodule: PASSED (2787.16s)
RESULTS - devtool.DevtoolTest.test_devtool_location: PASSED (0.08s)
RESULTS - devtool.DevtoolTest.test_extend_autotools_recipe_creation: PASSED (416.22s)
RESULTS - devtool.DevtoolTest.test_recipes_for_nodejs: PASSED (74.01s)
RESULTS - devtool.SdkUpdateTest.test_sdk_update_http: PASSED (8.04s)
RESULTS - go.GoCompileTest.test_go_build: SKIPPED (0.00s)
RESULTS - go.GoCompileTest.test_go_module: SKIPPED (0.00s)
RESULTS - go.GoHostCompileTest.test_go_cross_compile: SKIPPED (0.00s)
RESULTS - go.GoHostCompileTest.test_go_module_cross_compile: SKIPPED (0.00s)
RESULTS - gtk3.GTK3Test.test_libhandy: SKIPPED (0.00s)
RESULTS - kmod.KernelModuleTest.test_cryptodev: SKIPPED (0.00s)
RESULTS - maturin.MaturinDevelopTest.test_maturin_develop: SKIPPED (125.64s)
RESULTS - meson.MesonTest.test_iputils: SKIPPED (0.00s)
RESULTS - rust.RustCompileTest.test_cargo_build: SKIPPED (0.00s)
RESULTS - rust.RustHostCompileTest.test_cargo_build: SKIPPED (0.00s)
SUMMARY:
core-image-sato esdk (poky-glibc-x86_64-core-image-sato-riscv64imafdc_zicsr_zifencei-qemuriscv64-toolchain-ext-6.1.99+snapshot.sh:environment-setup-riscv64imafdc_zicsr_zifencei-poky-linux) - Ran 30 tests in 5112.348s
core-image-sato esdk - OK - All required tests passed (successes=20, skipped=10, failures=0, errors=0)
NOTE: recipe core-image-sato-1.0-r0: task do_testsdkext: Succeeded
RESULTS:
RESULTS - autotools.AutotoolsTest.test_cpio: PASSED (269.55s)
RESULTS - cmake.CMakeTest.test_assimp: PASSED (938.43s)
RESULTS - gcc.GccCompileTest.test_gcc_compile: PASSED (0.80s)
RESULTS - gcc.GccCompileTest.test_gpp2_compile: PASSED (0.78s)
RESULTS - gcc.GccCompileTest.test_gpp_compile: PASSED (2.34s)
RESULTS - gcc.GccCompileTest.test_make: PASSED (0.82s)
RESULTS - makefile.MakefileTest.test_lzip: PASSED (17.12s)
RESULTS - manifest.ManifestTest.test_manifests: PASSED (0.00s)
RESULTS - maturin.MaturinTest.test_maturin_list_python: PASSED (14.08s)
RESULTS - perl.PerlTest.test_perl: PASSED (0.11s)
RESULTS - python.Python3Test.test_python3: PASSED (10.14s)
RESULTS - devtool.DevtoolTest.test_devtool_add_reset: PASSED (58.95s)
RESULTS - devtool.DevtoolTest.test_devtool_build_cmake: PASSED (129.54s)
RESULTS - devtool.DevtoolTest.test_devtool_build_esdk_package: PASSED (115.03s)
RESULTS - devtool.DevtoolTest.test_devtool_build_make: PASSED (120.64s)
RESULTS - devtool.DevtoolTest.test_devtool_kernelmodule: PASSED (2796.74s)
RESULTS - devtool.DevtoolTest.test_devtool_location: PASSED (0.08s)
RESULTS - devtool.DevtoolTest.test_extend_autotools_recipe_creation: PASSED (401.72s)
RESULTS - devtool.DevtoolTest.test_recipes_for_nodejs: PASSED (71.18s)
RESULTS - devtool.SdkUpdateTest.test_sdk_update_http: PASSED (7.96s)
RESULTS - go.GoCompileTest.test_go_build: SKIPPED (0.00s)
RESULTS - go.GoCompileTest.test_go_module: SKIPPED (0.00s)
RESULTS - go.GoHostCompileTest.test_go_cross_compile: SKIPPED (0.00s)
RESULTS - go.GoHostCompileTest.test_go_module_cross_compile: SKIPPED (0.00s)
RESULTS - gtk3.GTK3Test.test_libhandy: SKIPPED (0.00s)
RESULTS - kmod.KernelModuleTest.test_cryptodev: SKIPPED (0.00s)
RESULTS - maturin.MaturinDevelopTest.test_maturin_develop: SKIPPED (101.04s)
RESULTS - meson.MesonTest.test_iputils: SKIPPED (0.00s)
RESULTS - rust.RustCompileTest.test_cargo_build: SKIPPED (0.00s)
RESULTS - rust.RustHostCompileTest.test_cargo_build: SKIPPED (0.00s)
SUMMARY:
core-image-minimal esdk (poky-glibc-x86_64-core-image-minimal-riscv64imafdc_zicsr_zifencei-qemuriscv64-toolchain-ext-6.1.99+snapshot.sh:environment-setup-riscv64imafdc_zicsr_zifencei-poky-linux) - Ran 30 tests in 5151.636s
core-image-minimal esdk - OK - All required tests passed (successes=20, skipped=10, failures=0, errors=0)
NOTE: recipe core-image-minimal-1.0-r0: task do_testsdkext: Succeeded
Bitbake still alive (no events for 600s). Active tasks:
/srv/pokybuild/yocto-worker/qemuriscv64/build/layers/openembedded-core/meta/recipes-sato/images/core-image-sato-sdk.bb:do_testimage
Bitbake still alive (no events for 1200s). Active tasks:
/srv/pokybuild/yocto-worker/qemuriscv64/build/layers/openembedded-core/meta/recipes-sato/images/core-image-sato-sdk.bb:do_testimage
Test run when enable usrmerge
Bitbake still alive (no events for 600s). Active tasks:
/srv/pokybuild/yocto-worker/qemuriscv64/build/layers/openembedded-core/meta/recipes-sato/images/core-image-sato-sdk.bb:do_testimage
Traceback (most recent call last):
File "/srv/pokybuild/yocto-worker/qemuriscv64/build/layers/openembedded-core/meta/lib/oeqa/core/decorator/__init__.py", line 35, in wrapped_f
return func(*args, **kwargs)
File "/srv/pokybuild/yocto-worker/qemuriscv64/build/layers/openembedded-core/meta/lib/oeqa/core/decorator/__init__.py", line 35, in wrapped_f
return func(*args, **kwargs)
File "/srv/pokybuild/yocto-worker/qemuriscv64/build/layers/openembedded-core/meta/lib/oeqa/core/decorator/__init__.py", line 35, in wrapped_f
return func(*args, **kwargs)
[Previous line repeated 1 more time]
File "/srv/pokybuild/yocto-worker/qemuriscv64/build/layers/openembedded-core/meta/lib/oeqa/runtime/cases/go.py", line 38, in test_go_compile
status, output = self.target.run('go build -o /tmp/test /tmp/test.go', 600)
~~~~~~~~~~~~~~~^^^^^^^^^^^^^^^^^^^^^^^^^^^^^^^^^^^^^^^^^^^
File "/srv/pokybuild/yocto-worker/qemuriscv64/build/layers/openembedded-core/meta/lib/oeqa/core/target/ssh.py", line 98, in run
status, output = self._run(sshCmd, processTimeout, ignore_status, raw, ignore_ssh_fails)
~~~~~~~~~^^^^^^^^^^^^^^^^^^^^^^^^^^^^^^^^^^^^^^^^^^^^^^^^^^^^^^^^^^^^^^
File "/srv/pokybuild/yocto-worker/qemuriscv64/build/layers/openembedded-core/meta/lib/oeqa/core/target/ssh.py", line 70, in _run
raise AssertionError("ssh exited with status '255' for command "
"'%s': this is likely an SSH failure\n%s"
% (command, output))
AssertionError: ssh exited with status '255' for command '['ssh', '-l', 'root', '-o', 'ServerAliveCountMax=2', '-o', 'ServerAliveInterval=30', '-o', 'UserKnownHostsFile=/dev/null', '-o', 'StrictHostKeyChecking=no', '-o', 'LogLevel=ERROR', '192.168.7.6', 'export PATH=/usr/sbin:/sbin:/usr/bin:/bin; go build -o /tmp/test /tmp/test.go']': this is likely an SSH failure
Process killed - no output for 600 seconds. Total running time: 605 seconds.
Bitbake still alive (no events for 600s). Active tasks:
/srv/pokybuild/yocto-worker/qemuriscv64/build/layers/openembedded-core/meta/recipes-sato/images/core-image-sato-sdk.bb:do_testimage
Bitbake still alive (no events for 1200s). Active tasks:
/srv/pokybuild/yocto-worker/qemuriscv64/build/layers/openembedded-core/meta/recipes-sato/images/core-image-sato-sdk.bb:do_testimage
Bitbake still alive (no events for 1800s). Active tasks:
/srv/pokybuild/yocto-worker/qemuriscv64/build/layers/openembedded-core/meta/recipes-sato/images/core-image-sato-sdk.bb:do_testimage
Bitbake still alive (no events for 2400s). Active tasks:
/srv/pokybuild/yocto-worker/qemuriscv64/build/layers/openembedded-core/meta/recipes-sato/images/core-image-sato-sdk.bb:do_testimage
Bitbake still alive (no events for 3000s). Active tasks:
/srv/pokybuild/yocto-worker/qemuriscv64/build/layers/openembedded-core/meta/recipes-sato/images/core-image-sato-sdk.bb:do_testimage
Bitbake still alive (no events for 3600s). Active tasks:
/srv/pokybuild/yocto-worker/qemuriscv64/build/layers/openembedded-core/meta/recipes-sato/images/core-image-sato-sdk.bb:do_testimage
Test requires opkg to be installed
Test requires pam to be in DISTRO_FEATURES
Test requires ptest-runner to be installed
Test requires ptest-runner to be installed
Test requires rust-c-lib-example-bin to be installed
Bitbake still alive (no events for 600s). Active tasks:
/srv/pokybuild/yocto-worker/qemuriscv64/build/layers/openembedded-core/meta/recipes-sato/images/core-image-sato-sdk.bb:do_testimage
Bitbake still alive (no events for 1200s). Active tasks:
/srv/pokybuild/yocto-worker/qemuriscv64/build/layers/openembedded-core/meta/recipes-sato/images/core-image-sato-sdk.bb:do_testimage
systemd is not the init manager for this image
Test case systemd.SystemdBasicTests.test_systemd_failed depends on systemd.SystemdBasicTests.test_systemd_basic but it didn't pass/run.
Test case systemd.SystemdBasicTests.test_systemd_list depends on systemd.SystemdBasicTests.test_systemd_basic but it didn't pass/run.
Test case systemd.SystemdJournalTests.test_systemd_boot_time depends on systemd.SystemdBasicTests.test_systemd_basic but it didn't pass/run.
Test case systemd.SystemdJournalTests.test_systemd_journal depends on systemd.SystemdBasicTests.test_systemd_basic but it didn't pass/run.
Test requires minidebuginfo to be in DISTRO_FEATURES
Test case systemd.SystemdServiceTests.test_systemd_status depends on systemd.SystemdBasicTests.test_systemd_basic but it didn't pass/run.
Test case systemd.SystemdServiceTests.test_systemd_disable_enable depends on systemd.SystemdServiceTests.test_systemd_status but it didn't pass/run.
Test is only meant to run with read-only-rootfs in IMAGE_FEATURES
Test case systemd.SystemdServiceTests.test_systemd_stop_start depends on systemd.SystemdServiceTests.test_systemd_status but it didn't pass/run.
Test requires wayland-utils to be installed
Test requires weston to be installed
Test requires weston to be installed
Test requires weston to be installed
Output from runqemu:
runqemu - INFO - Received signal: 15
runqemu - INFO - Cleaning up
runqemu - INFO - Host uptime: 845775.90
runqemu - INFO - Removing /srv/pokybuild/yocto-worker/qemuriscv64/build/build/tmp/deploy/images/qemuriscv64/core-image-sato-sdk-qemuriscv64.rootfs-20261029082726.ext4
runqemu - INFO - Removing /home/pokybuild/tmp/core-image-sato-sdk-qemuriscv64.rootfs-20261029082726.ext4.3336015
tput: No value for $TERM and no -T specified
RESULTS:
RESULTS - buildcpio.BuildCpioTest.test_cpio: PASSED (5118.52s)
RESULTS - buildlzip.BuildLzipTest.test_lzip: PASSED (1862.78s)
RESULTS - connman.ConnmanTest.test_connmand_help: PASSED (2.03s)
RESULTS - connman.ConnmanTest.test_connmand_running: PASSED (2.48s)
RESULTS - date.DateTest.test_date: PASSED (7.19s)
RESULTS - df.DfTest.test_df: PASSED (1.95s)
RESULTS - dnf.DnfBasicTest.test_dnf_help: PASSED (131.04s)
RESULTS - dnf.DnfBasicTest.test_dnf_history: PASSED (44.44s)
RESULTS - dnf.DnfBasicTest.test_dnf_info: PASSED (41.20s)
RESULTS - dnf.DnfBasicTest.test_dnf_search: PASSED (39.38s)
RESULTS - dnf.DnfBasicTest.test_dnf_version: PASSED (39.09s)
RESULTS - dnf.DnfRepoTest.test_dnf_exclude: PASSED (155.57s)
RESULTS - dnf.DnfRepoTest.test_dnf_install: PASSED (129.65s)
RESULTS - dnf.DnfRepoTest.test_dnf_install_dependency: PASSED (174.30s)
RESULTS - dnf.DnfRepoTest.test_dnf_install_from_disk: PASSED (169.83s)
RESULTS - dnf.DnfRepoTest.test_dnf_install_from_http: PASSED (135.61s)
RESULTS - dnf.DnfRepoTest.test_dnf_installroot: PASSED (296.29s)
RESULTS - dnf.DnfRepoTest.test_dnf_makecache: PASSED (32.05s)
RESULTS - dnf.DnfRepoTest.test_dnf_reinstall: PASSED (62.32s)
RESULTS - dnf.DnfRepoTest.test_dnf_repoinfo: PASSED (42.38s)
RESULTS - gcc.GccCompileTest.test_gcc_compile: PASSED (19.17s)
RESULTS - gcc.GccCompileTest.test_gpp2_compile: PASSED (20.27s)
RESULTS - gcc.GccCompileTest.test_gpp_compile: PASSED (62.86s)
RESULTS - gcc.GccCompileTest.test_make: PASSED (17.14s)
RESULTS - gi.GObjectIntrospectionTest.test_python: PASSED (20.37s)
RESULTS - go.CgoHelloworldTest.test_cgohelloworld: PASSED (2.35s)
RESULTS - go.GoCompileTest.test_go_module: PASSED (409.34s)
RESULTS - go.GoHelloworldTest.test_gohelloworld: PASSED (2.42s)
RESULTS - kernelmodule.KernelModuleTest.test_kernel_module: PASSED (3979.64s)
RESULTS - ldd.LddTest.test_ldd: PASSED (26.27s)
RESULTS - logrotate.LogrotateTest.test_logrotate_newlog: PASSED (35.49s)
RESULTS - logrotate.LogrotateTest.test_logrotate_wtmp: PASSED (36.36s)
RESULTS - oe_syslog.SyslogTest.test_syslog_running: PASSED (8.30s)
RESULTS - oe_syslog.SyslogTestConfig.test_syslog_logger: PASSED (18.94s)
RESULTS - oe_syslog.SyslogTestConfig.test_syslog_restart: PASSED (74.07s)
RESULTS - oe_syslog.SyslogTestConfig.test_syslog_startup_config: PASSED (135.38s)
RESULTS - parselogs.ParseLogsTest.test_get_context: PASSED (0.00s)
RESULTS - parselogs.ParseLogsTest.test_parselogs: PASSED (50.77s)
RESULTS - perl.PerlTest.test_perl_works: PASSED (4.52s)
RESULTS - ping.PingTest.test_ping: PASSED (0.12s)
RESULTS - python.PythonTest.test_python3: PASSED (11.10s)
RESULTS - rpm.RpmBasicTest.test_rpm_help: PASSED (9.59s)
RESULTS - rpm.RpmBasicTest.test_rpm_query: PASSED (15.67s)
RESULTS - rpm.RpmBasicTest.test_rpm_query_nonroot: PASSED (73.37s)
RESULTS - rpm.RpmInstallRemoveTest.test_check_rpm_install_removal_log_file_size: PASSED (574.69s)
RESULTS - rpm.RpmInstallRemoveTest.test_rpm_install: PASSED (35.79s)
RESULTS - rpm.RpmInstallRemoveTest.test_rpm_remove: PASSED (15.42s)
RESULTS - rust.RustCompileTest.test_cargo_compile: PASSED (205.25s)
RESULTS - rust.RustCompileTest.test_rust_compile: PASSED (91.11s)
RESULTS - scp.ScpTest.test_scp_file: PASSED (36.93s)
RESULTS - ssh.SSHTest.test_ssh: PASSED (3.79s)
RESULTS - stap.StapTest.test_stap: PASSED (1305.69s)
RESULTS - xorg.XorgTest.test_xorg_running: PASSED (25.94s)
RESULTS - apt.AptRepoTest.test_apt_install_from_repo: SKIPPED (0.00s)
RESULTS - buildgalculator.GalculatorTest.test_galculator: SKIPPED (0.00s)
RESULTS - dnf.DnfRepoTest.test_dnf_installroot_usrmerge: SKIPPED (0.00s)
RESULTS - opkg.OpkgRepoTest.test_opkg_install_from_repo: SKIPPED (0.00s)
RESULTS - pam.PamBasicTest.test_pam: SKIPPED (0.01s)
RESULTS - ptest.PtestRunnerTest.test_ptestrunner_expectfail: SKIPPED (0.00s)
RESULTS - ptest.PtestRunnerTest.test_ptestrunner_expectsuccess: SKIPPED (0.00s)
RESULTS - rust.RustCLibExampleTest.test_rust_c_lib_example: SKIPPED (0.01s)
RESULTS - systemd.SystemdBasicTests.test_systemd_basic: SKIPPED (0.00s)
RESULTS - systemd.SystemdBasicTests.test_systemd_failed: SKIPPED (0.00s)
RESULTS - systemd.SystemdBasicTests.test_systemd_list: SKIPPED (0.00s)
RESULTS - systemd.SystemdJournalTests.test_systemd_boot_time: SKIPPED (0.00s)
RESULTS - systemd.SystemdJournalTests.test_systemd_journal: SKIPPED (0.00s)
RESULTS - systemd.SystemdServiceTests.test_systemd_coredump_minidebuginfo: SKIPPED (0.00s)
RESULTS - systemd.SystemdServiceTests.test_systemd_disable_enable: SKIPPED (0.00s)
RESULTS - systemd.SystemdServiceTests.test_systemd_disable_enable_ro: SKIPPED (0.00s)
RESULTS - systemd.SystemdServiceTests.test_systemd_status: SKIPPED (0.00s)
RESULTS - systemd.SystemdServiceTests.test_systemd_stop_start: SKIPPED (0.00s)
RESULTS - weston.WestonTest.test_wayland_info: SKIPPED (0.00s)
RESULTS - weston.WestonTest.test_weston_can_initialize_new_wayland_compositor: SKIPPED (0.00s)
RESULTS - weston.WestonTest.test_weston_running: SKIPPED (0.00s)
RESULTS - weston.WestonTest.test_weston_supports_xwayland: SKIPPED (0.00s)
RESULTS - go.GoCompileTest.test_go_compile: FAILED (618.96s)
SUMMARY:
core-image-sato-sdk () - Ran 76 tests in 16444.128s
core-image-sato-sdk - FAIL - Required tests failed (successes=53, skipped=22, failures=1, errors=0)
core-image-sato-sdk - FAILED - Last lines of QEMU boot logs:
--- qemu_boot_log.20261029095006 ---
matchbox: Cant find a keycode for keysym 269025056
matchbox: ignoring key shortcut XF86Calendar=!$contacts
matchbox: Cant find a keycode for keysym 2809
matchbox: ignoring key shortcut telephone=!$dates
matchbox: Cant find a keycode for keysym 269025050
matchbox: ignoring key shortcut XF86Start=!matchbox-remote -desktop
[settings daemon] Forking. run with -n to prevent fork
dbus-daemon[707]: Activating service name='org.a11y.atspi.Registry' requested by ':1.2' (uid=0 pid=686 comm="connman-applet")
dbus-daemon[707]: Successfully activated service 'org.a11y.atspi.Registry'
SpiRegistry daemon is running with well-known name - org.a11y.atspi.Registry
** (at-spi2-registryd:726): [1;33mWARNING[0m **: [34m09:55:24.493[0m: Disabling unresponsive app with pid 704
** (at-spi2-registryd:726): [1;33mWARNING[0m **: [34m09:56:52.688[0m: Re-enabling app with pid 704
[13763.034383] hellomod: loading out-of-tree module taints kernel.
[13763.254809] Hello world!
[13771.719186] Cleaning up hellomod.
--- qemu_boot_log.20261029095006.2 ---
pci id for fd 11: 1234:1111, driver (null)
pci id for fd 12: 1234:1111, driver (null)
pci id for fd 11: 1234:1111, driver (null)
Starting crond: pci id for fd 12: 1234:1111, driver (null)
OK
Poky (Yocto Project Reference Distro) 6.1.99+snapshot-7c504ae09db5dc015caa5127333b77b150577e1c qemuriscv64 ttyS0
Type 'root' to login with superuser privileges (no password will be asked).
qemuriscv64 login: [13763.034383] hellomod: loading out-of-tree module taints kernel.
[13763.254809] Hello world!
[13771.719186] Cleaning up hellomod.
ERROR: core-image-sato-sdk-1.0-r0 do_testimage: core-image-sato-sdk - FAILED - also check the logs in /srv/pokybuild/yocto-worker/qemuriscv64/build/build/tmp/log
NOTE: recipe core-image-sato-sdk-1.0-r0: task do_testimage: Succeeded
NOTE: Tasks Summary: Attempted 1552 tasks of which 1546 didn't need to be rerun and all succeeded.
Summary: There was 1 ERROR message, returning a non-zero exit code.